{"text_format":"1","workbook":"xlsx","n_sheets":17,"sheets":["Visibility","Dropdowns","CountyScores","Cover Page","Instructions","Project Overview","HDPL Unit Mix","Grant-Loan Amount","HDPL Dev Sources","HDPL Dev Budget SU","CalHome Threshold Requirements","FWHG Threshold Requiremets","HOSN Scoring","Tribal NOFA Scoring","Entity Org Docs","Document Checklist-Full List","Application Support"],"not_rendered":{"charts":0,"images":3,"macros":1,"external_links":1,"defined_names":761,"comments":9,"pivot_tables":0},"unopened":[],"bounds":{"document_bytes":16777216,"sheet_cells":100000,"rows_first":2000,"rows_last":500,"rows_between":2000,"halvings":0,"cell_chars":16384,"cell_head_chars":4096},"cells_cut":0,"cells_raw":0,"read":"whole","date_system":"1900"}

{"sheet":"Visibility","index":0,"n_rows":392,"n_cols":20,"rows_kept":392,"cut":false,"hidden":true,"merged":[[3,15,3,16],[1,8,2,9],[2,2,2,3],[2,4,2,5],[2,15,2,19]]}
[]
[null,null,null,null,null,null,null,null,"Hide Based on Characteristic"]
[null,"ComponentVisibility","Hide Row(s)",null,"Hide Colum(s)",null,null,null,null,null,"IsPrograms",null,null,null,null,"HDC Use Only"]
[null,"SheetName","StartRow","EndRow","StartCol","EndCol","Visible","Description","Force True","Force False","Program True",null,null,null,null,null,null,"Reviewer 1","Reviewer 2","Manager Review"]
[null,"Application Support",null,null,null,null,{"$f":"OR(ComponentVisibility[[#This Row],[Force True]],AND(ComponentVisibility[[#This Row],[Program True]],NOT(ComponentVisibility[[#This Row],[Force False]])))","v":false},"Vissible Sheet if \"TRUE\"",{"$f":"OR(IsCalhome,IsJSerna)","v":false},null,false,null,null,null,null,"Start CalHome Threshold review?"]
[null,"CalHome Threshold Requirements",{"$f":"ROW('CalHome Threshold Requirements'!A16)","v":16},{"$f":"ROW('CalHome Threshold Requirements'!A16)","v":16},null,null,{"$f":"OR(ComponentVisibility[[#This Row],[Force True]],AND(ComponentVisibility[[#This Row],[Program True]],NOT(ComponentVisibility[[#This Row],[Force False]])))","v":false},"Vissible Sheet if \"TRUE\"",{"$f":"vmApplicant1Type=\"Local Public Entity\"","v":false},null,false,null,null,null,null,"Start Serna Threshold review?"]
[null,"CalHome Threshold Requirements",{"$f":"ROW('CalHome Threshold Requirements'!A17)","v":17},{"$f":"ROW('CalHome Threshold Requirements'!A17)","v":17},null,null,{"$f":"OR(ComponentVisibility[[#This Row],[Force True]],AND(ComponentVisibility[[#This Row],[Program True]],NOT(ComponentVisibility[[#This Row],[Force False]])))","v":false},"Vissible Sheet if \"TRUE\"",{"$f":"IF(vmApplicant1Type=\"Local Public Entity\",TRUE,FALSE)","v":false},null,false,null,null,null,null,"Start HOSN Scoring review?"]
[null,"CalHome Threshold Requirements",{"$f":"ROW('CalHome Threshold Requirements'!A18)","v":18},{"$f":"ROW('CalHome Threshold Requirements'!A18)","v":18},null,null,{"$f":"OR(ComponentVisibility[[#This Row],[Force True]],AND(ComponentVisibility[[#This Row],[Program True]],NOT(ComponentVisibility[[#This Row],[Force False]])))","v":false},"Vissible row(s) if \"TRUE\"",{"$f":"IF(vmApplicant1Type=\"Tribal Entity\",TRUE,FALSE)","v":false},null,false,null,null,null,null,"Start Tribal NOFA Scoring review?"]
[null,"CalHome Threshold Requirements",{"$f":"ROW('CalHome Threshold Requirements'!A20)","v":20},{"$f":"ROW('CalHome Threshold Requirements'!A28)","v":28},null,null,{"$f":"OR(ComponentVisibility[[#This Row],[Force True]],AND(ComponentVisibility[[#This Row],[Program True]],NOT(ComponentVisibility[[#This Row],[Force False]])))","v":false},"Vissible row(s) if \"TRUE\"",{"$f":"OR(vmApplicant1Type=\"Tribal Entity\",vmApplicant1Type=\"Nonprofit Corporation\")","v":false},null,false]
[null,"CalHome Threshold Requirements",{"$f":"ROW('CalHome Threshold Requirements'!A22)","v":22},{"$f":"ROW('CalHome Threshold Requirements'!A25)","v":25},null,null,{"$f":"OR(ComponentVisibility[[#This Row],[Force True]],AND(ComponentVisibility[[#This Row],[Program True]],NOT(ComponentVisibility[[#This Row],[Force False]])))","v":false},"Vissible row(s) if \"TRUE\"",{"$f":"vmCDO=\"Yes\"","v":false},null,false]
[null,"CalHome Threshold Requirements",{"$f":"ROW('CalHome Threshold Requirements'!A27)","v":27},{"$f":"ROW('CalHome Threshold Requirements'!A27)","v":27},null,null,{"$f":"OR(ComponentVisibility[[#This Row],[Force True]],AND(ComponentVisibility[[#This Row],[Program True]],NOT(ComponentVisibility[[#This Row],[Force False]])))","v":false},"Vissible row(s) if \"TRUE\"",{"$f":"vm523SH=\"Yes\"","v":false},null,false]
[null,"CalHome Threshold Requirements",{"$f":"ROW('CalHome Threshold Requirements'!A34)","v":34},{"$f":"ROW('CalHome Threshold Requirements'!A35)","v":35},null,null,{"$f":"OR(ComponentVisibility[[#This Row],[Force True]],AND(ComponentVisibility[[#This Row],[Program True]],NOT(ComponentVisibility[[#This Row],[Force False]])))","v":false},"Vissible row(s) if \"TRUE\"",{"$f":"vmC2years=\"Yes\"","v":false},null,false]
[null,"CalHome Threshold Requirements",{"$f":"ROW('CalHome Threshold Requirements'!A36)","v":36},{"$f":"ROW('CalHome Threshold Requirements'!A37)","v":37},null,null,{"$f":"OR(ComponentVisibility[[#This Row],[Force True]],AND(ComponentVisibility[[#This Row],[Program True]],NOT(ComponentVisibility[[#This Row],[Force False]])))","v":false},"Vissible row(s) if \"TRUE\"",{"$f":"AND(vmApplicant1Type=\"Tribal Entity\",vmC2years=\"No\")","v":false},null,false]
[null,"CalHome Threshold Requirements",{"$f":"ROW('CalHome Threshold Requirements'!A38)","v":38},{"$f":"ROW('CalHome Threshold Requirements'!A38)","v":38},null,null,{"$f":"OR(ComponentVisibility[[#This Row],[Force True]],AND(ComponentVisibility[[#This Row],[Program True]],NOT(ComponentVisibility[[#This Row],[Force False]])))","v":false},"Vissible row(s) if \"TRUE\"",{"$f":"IF(OR(vmApplicant1Type=\"Local Public Entity\",vmApplicant1Type=\"Tribal Entity\"),TRUE,FALSE)","v":false},null,false]
[null,"CalHome Threshold Requirements",{"$f":"ROW('CalHome Threshold Requirements'!A39)","v":39},{"$f":"ROW('CalHome Threshold Requirements'!A45)","v":45},null,null,{"$f":"OR(ComponentVisibility[[#This Row],[Force True]],AND(ComponentVisibility[[#This Row],[Program True]],NOT(ComponentVisibility[[#This Row],[Force False]])))","v":false},"Vissible row(s) if \"TRUE\"",{"$f":"vmCLocalityAS=\"Yes\"","v":false},null,false]
[null,"CalHome Threshold Requirements",{"$f":"ROW('CalHome Threshold Requirements'!A41)","v":41},{"$f":"ROW('CalHome Threshold Requirements'!A48)","v":48},null,null,{"$f":"OR(ComponentVisibility[[#This Row],[Force True]],AND(ComponentVisibility[[#This Row],[Program True]],NOT(ComponentVisibility[[#This Row],[Force False]])))","v":false},"Vissible row(s) if \"TRUE\"",{"$f":"IF(OR(vmApplicant1Type=\"Local Public Entity\",vmApplicant1Type=\"Tribal Entity\"),TRUE,FALSE)","v":false},null,false]
[null,"CalHome Threshold Requirements",{"$f":"ROW('CalHome Threshold Requirements'!A47)","v":47},{"$f":"ROW('CalHome Threshold Requirements'!A48)","v":48},null,null,{"$f":"OR(ComponentVisibility[[#This Row],[Force True]],AND(ComponentVisibility[[#This Row],[Program True]],NOT(ComponentVisibility[[#This Row],[Force False]])))","v":false},"Vissible row(s) if \"TRUE\"",{"$f":"vmCCA=\"Yes\"","v":false},null,false]
[null,"CalHome Threshold Requirements",{"$f":"ROW('CalHome Threshold Requirements'!A50)","v":50},{"$f":"ROW('CalHome Threshold Requirements'!A55)","v":55},null,null,{"$f":"OR(ComponentVisibility[[#This Row],[Force True]],AND(ComponentVisibility[[#This Row],[Program True]],NOT(ComponentVisibility[[#This Row],[Force False]])))","v":false},"Vissible row(s) if \"TRUE\"",{"$f":"vmApplicant1Type=\"Nonprofit Corporation\"","v":false},null,false]
[null,"CalHome Threshold Requirements",{"$f":"ROW('CalHome Threshold Requirements'!A63)","v":63},{"$f":"ROW('CalHome Threshold Requirements'!A65)","v":65},null,null,{"$f":"OR(ComponentVisibility[[#This Row],[Force True]],AND(ComponentVisibility[[#This Row],[Program True]],NOT(ComponentVisibility[[#This Row],[Force False]])))","v":false},"Vissible row(s) if \"TRUE\"",{"$f":"vmCRE=\"Yes\"","v":false},null,false]
[null,"CalHome Threshold Requirements",{"$f":"ROW('CalHome Threshold Requirements'!A67)","v":67},{"$f":"ROW('CalHome Threshold Requirements'!A69)","v":69},null,null,{"$f":"OR(ComponentVisibility[[#This Row],[Force True]],AND(ComponentVisibility[[#This Row],[Program True]],NOT(ComponentVisibility[[#This Row],[Force False]])))","v":false},"Vissible row(s) if \"TRUE\"",{"$f":"vmCBDFT=\"Yes\"","v":false},null,false]
[null,"CalHome Threshold Requirements",{"$f":"ROW('CalHome Threshold Requirements'!A74)","v":74},{"$f":"ROW('CalHome Threshold Requirements'!A77)","v":77},null,null,{"$f":"OR(ComponentVisibility[[#This Row],[Force True]],AND(ComponentVisibility[[#This Row],[Program True]],NOT(ComponentVisibility[[#This Row],[Force False]])))","v":false},"Vissible row(s) if \"TRUE\"",{"$f":"vmIsHDPL=\"Yes\"","v":false},null,false]
[null,"CalHome Threshold Requirements",{"$f":"ROW('CalHome Threshold Requirements'!A78)","v":78},{"$f":"ROW('CalHome Threshold Requirements'!A78)","v":78},null,null,{"$f":"OR(ComponentVisibility[[#This Row],[Force True]],AND(ComponentVisibility[[#This Row],[Program True]],NOT(ComponentVisibility[[#This Row],[Force False]])))","v":false},"Vissible row(s) if \"TRUE\"",{"$f":"vmCWE=\"Yes\"","v":false},null,false]
[null,"CalHome Threshold Requirements",{"$f":"ROW('CalHome Threshold Requirements'!A79)","v":79},{"$f":"ROW('CalHome Threshold Requirements'!A79)","v":79},null,null,{"$f":"OR(ComponentVisibility[[#This Row],[Force True]],AND(ComponentVisibility[[#This Row],[Program True]],NOT(ComponentVisibility[[#This Row],[Force False]])))","v":false},"Vissible row(s) if \"TRUE\"",{"$f":"vmIsSHTA=\"Yes\"","v":false},null,false]
[null,"CalHome Threshold Requirements",{"$f":"ROW('CalHome Threshold Requirements'!A80)","v":80},{"$f":"ROW('CalHome Threshold Requirements'!A80)","v":80},null,null,{"$f":"OR(ComponentVisibility[[#This Row],[Force True]],AND(ComponentVisibility[[#This Row],[Program True]],NOT(ComponentVisibility[[#This Row],[Force False]])))","v":false},"Vissible row(s) if \"TRUE\"",{"$f":"vmIsMA=\"Yes\"","v":false},null,false]
[null,"CalHome Threshold Requirements",{"$f":"ROW('CalHome Threshold Requirements'!A81)","v":81},{"$f":"ROW('CalHome Threshold Requirements'!A81)","v":81},null,null,{"$f":"OR(ComponentVisibility[[#This Row],[Force True]],AND(ComponentVisibility[[#This Row],[Program True]],NOT(ComponentVisibility[[#This Row],[Force False]])))","v":false},"Vissible row(s) if \"TRUE\"",{"$f":"vmIsOOR=\"Yes\"","v":false},null,false]
[null,"CalHome Threshold Requirements",{"$f":"ROW('CalHome Threshold Requirements'!A82)","v":82},{"$f":"ROW('CalHome Threshold Requirements'!A82)","v":82},null,null,{"$f":"OR(ComponentVisibility[[#This Row],[Force True]],AND(ComponentVisibility[[#This Row],[Program True]],NOT(ComponentVisibility[[#This Row],[Force False]])))","v":false},"Vissible row(s) if \"TRUE\"",{"$f":"vmIsSH=\"Yes\"","v":false},null,false]
[null,"CalHome Threshold Requirements",{"$f":"ROW('CalHome Threshold Requirements'!A83)","v":83},{"$f":"ROW('CalHome Threshold Requirements'!A83)","v":83},null,null,{"$f":"OR(ComponentVisibility[[#This Row],[Force True]],AND(ComponentVisibility[[#This Row],[Program True]],NOT(ComponentVisibility[[#This Row],[Force False]])))","v":false},"Vissible row(s) if \"TRUE\"",{"$f":"vmIsJADU=\"Yes\"","v":false},null,false]
[null,"CalHome Threshold Requirements",{"$f":"ROW('CalHome Threshold Requirements'!A88)","v":88},{"$f":"ROW('CalHome Threshold Requirements'!A88)","v":88},null,null,{"$f":"OR(ComponentVisibility[[#This Row],[Force True]],AND(ComponentVisibility[[#This Row],[Program True]],NOT(ComponentVisibility[[#This Row],[Force False]])))","v":false},"Vissible row(s) if \"TRUE\"",{"$f":"vmIsHDPL=\"Yes\"","v":false},null,false]
[null,"CalHome Threshold Requirements",{"$f":"ROW('CalHome Threshold Requirements'!A89)","v":89},{"$f":"ROW('CalHome Threshold Requirements'!A89)","v":89},null,null,{"$f":"OR(ComponentVisibility[[#This Row],[Force True]],AND(ComponentVisibility[[#This Row],[Program True]],NOT(ComponentVisibility[[#This Row],[Force False]])))","v":false},"Vissible row(s) if \"TRUE\"",{"$f":"vmIsSHTA=\"Yes\"","v":false},null,false]
[null,"CalHome Threshold Requirements",{"$f":"ROW('CalHome Threshold Requirements'!A90)","v":90},{"$f":"ROW('CalHome Threshold Requirements'!A90)","v":90},null,null,{"$f":"OR(ComponentVisibility[[#This Row],[Force True]],AND(ComponentVisibility[[#This Row],[Program True]],NOT(ComponentVisibility[[#This Row],[Force False]])))","v":false},"Vissible row(s) if \"TRUE\"",{"$f":"vmIsMA=\"Yes\"","v":false},null,false]
[null,"CalHome Threshold Requirements",{"$f":"ROW('CalHome Threshold Requirements'!A91)","v":91},{"$f":"ROW('CalHome Threshold Requirements'!A91)","v":91},null,null,{"$f":"OR(ComponentVisibility[[#This Row],[Force True]],AND(ComponentVisibility[[#This Row],[Program True]],NOT(ComponentVisibility[[#This Row],[Force False]])))","v":false},"Vissible row(s) if \"TRUE\"",{"$f":"vmIsOOR=\"Yes\"","v":false},null,false]
[null,"CalHome Threshold Requirements",{"$f":"ROW('CalHome Threshold Requirements'!A92)","v":92},{"$f":"ROW('CalHome Threshold Requirements'!A92)","v":92},null,null,{"$f":"OR(ComponentVisibility[[#This Row],[Force True]],AND(ComponentVisibility[[#This Row],[Program True]],NOT(ComponentVisibility[[#This Row],[Force False]])))","v":false},"Vissible row(s) if \"TRUE\"",{"$f":"vmIsSH=\"Yes\"","v":false},null,false]
[null,"CalHome Threshold Requirements",{"$f":"ROW('CalHome Threshold Requirements'!A93)","v":93},{"$f":"ROW('CalHome Threshold Requirements'!A93)","v":93},null,null,{"$f":"OR(ComponentVisibility[[#This Row],[Force True]],AND(ComponentVisibility[[#This Row],[Program True]],NOT(ComponentVisibility[[#This Row],[Force False]])))","v":false},"Vissible row(s) if \"TRUE\"",{"$f":"vmIsJADU=\"Yes\"","v":false},null,false]
[null,"CalHome Threshold Requirements",{"$f":"ROW('CalHome Threshold Requirements'!A98)","v":98},{"$f":"ROW('CalHome Threshold Requirements'!A105)","v":105},null,null,{"$f":"OR(ComponentVisibility[[#This Row],[Force True]],AND(ComponentVisibility[[#This Row],[Program True]],NOT(ComponentVisibility[[#This Row],[Force False]])))","v":false},"Vissible row(s) if \"TRUE\"",{"$f":"vmIsMA=\"Yes\"","v":false},null,false]
[null,"CalHome Threshold Requirements",{"$f":"ROW('CalHome Threshold Requirements'!A106)","v":106},{"$f":"ROW('CalHome Threshold Requirements'!A113)","v":113},null,null,{"$f":"OR(ComponentVisibility[[#This Row],[Force True]],AND(ComponentVisibility[[#This Row],[Program True]],NOT(ComponentVisibility[[#This Row],[Force False]])))","v":false},"Vissible row(s) if \"TRUE\"",{"$f":"vmIsOOR=\"Yes\"","v":false},null,false]
[null,"CalHome Threshold Requirements",{"$f":"ROW('CalHome Threshold Requirements'!A114)","v":114},{"$f":"ROW('CalHome Threshold Requirements'!A125)","v":125},null,null,{"$f":"OR(ComponentVisibility[[#This Row],[Force True]],AND(ComponentVisibility[[#This Row],[Program True]],NOT(ComponentVisibility[[#This Row],[Force False]])))","v":false},"Vissible row(s) if \"TRUE\"",{"$f":"vmIsSHTA=\"Yes\"","v":false},null,false]
[null,"CalHome Threshold Requirements",{"$f":"ROW('CalHome Threshold Requirements'!A126)","v":126},{"$f":"ROW('CalHome Threshold Requirements'!A133)","v":133},null,null,{"$f":"OR(ComponentVisibility[[#This Row],[Force True]],AND(ComponentVisibility[[#This Row],[Program True]],NOT(ComponentVisibility[[#This Row],[Force False]])))","v":false},"Vissible row(s) if \"TRUE\"",{"$f":"vmIsSH=\"Yes\"","v":false},null,false]
[null,"CalHome Threshold Requirements",{"$f":"ROW('CalHome Threshold Requirements'!A134)","v":134},{"$f":"ROW('CalHome Threshold Requirements'!A142)","v":142},null,null,{"$f":"OR(ComponentVisibility[[#This Row],[Force True]],AND(ComponentVisibility[[#This Row],[Program True]],NOT(ComponentVisibility[[#This Row],[Force False]])))","v":false},"Vissible row(s) if \"TRUE\"",{"$f":"vmIsJADU=\"Yes\"","v":false},null,false]
[null,"CalHome Threshold Requirements",{"$f":"ROW('CalHome Threshold Requirements'!A143)","v":143},{"$f":"ROW('CalHome Threshold Requirements'!A146)","v":146},null,null,{"$f":"OR(ComponentVisibility[[#This Row],[Force True]],AND(ComponentVisibility[[#This Row],[Program True]],NOT(ComponentVisibility[[#This Row],[Force False]])))","v":false},"Vissible row(s) if \"TRUE\"",{"$f":"vmIsHDPL=\"Yes\"","v":false},null,false]
[null,"CalHome Threshold Requirements",{"$f":"ROW('CalHome Threshold Requirements'!A147)","v":147},{"$f":"ROW('CalHome Threshold Requirements'!A163)","v":163},null,null,{"$f":"OR(ComponentVisibility[[#This Row],[Force True]],AND(ComponentVisibility[[#This Row],[Program True]],NOT(ComponentVisibility[[#This Row],[Force False]])))","v":false},"Vissible row(s) if \"TRUE\"",{"$f":"vmC2P=\"Yes\"","v":false},null,false]
[null,"CalHome Threshold Requirements",{"$f":"ROW('CalHome Threshold Requirements'!A164)","v":164},{"$f":"ROW('CalHome Threshold Requirements'!A167)","v":167},null,null,{"$f":"OR(ComponentVisibility[[#This Row],[Force True]],AND(ComponentVisibility[[#This Row],[Program True]],NOT(ComponentVisibility[[#This Row],[Force False]])))","v":false},"Vissible row(s) if \"TRUE\"",{"$f":"vmHDPLMA=\"Yes\"","v":false},null,false]
[null,"CalHome Threshold Requirements",null,null,{"$f":"COLUMN('CalHome Threshold Requirements'!AO1)","v":41},{"$f":"COLUMN('CalHome Threshold Requirements'!AQ1)","v":43},{"$f":"OR(ComponentVisibility[[#This Row],[Force True]],AND(ComponentVisibility[[#This Row],[Program True]],NOT(ComponentVisibility[[#This Row],[Force False]])))","v":false},"Vissible row(s) if \"TRUE\"",{"$f":"AND(CalHomeTreview=\"Yes\",CalHomeTreviewR1=\"Yes\")","v":false},null,false]
[null,"CalHome Threshold Requirements",null,null,{"$f":"COLUMN('CalHome Threshold Requirements'!AR2)","v":44},{"$f":"COLUMN('CalHome Threshold Requirements'!AT2)","v":46},{"$f":"OR(ComponentVisibility[[#This Row],[Force True]],AND(ComponentVisibility[[#This Row],[Program True]],NOT(ComponentVisibility[[#This Row],[Force False]])))","v":false},"Vissible row(s) if \"TRUE\"",{"$f":"AND(CalHomeTreview=\"Yes\",CalHomeTreviewR2=\"Yes\")","v":false},null,false]
[null,"CalHome Threshold Requirements",null,null,{"$f":"COLUMN('CalHome Threshold Requirements'!AU3)","v":47},{"$f":"COLUMN('CalHome Threshold Requirements'!AW3)","v":49},{"$f":"OR(ComponentVisibility[[#This Row],[Force True]],AND(ComponentVisibility[[#This Row],[Program True]],NOT(ComponentVisibility[[#This Row],[Force False]])))","v":false},"Vissible row(s) if \"TRUE\"",{"$f":"AND(CalHomeTreview=\"Yes\",CalHomeTreviewM=\"Yes\")","v":false},null,false]
[null,"CalHome Threshold Requirements",null,null,null,null,{"$f":"OR(ComponentVisibility[[#This Row],[Force True]],AND(ComponentVisibility[[#This Row],[Program True]],NOT(ComponentVisibility[[#This Row],[Force False]])))","v":false},"Vissible Sheet if \"TRUE\"",{"$f":"vmIsCalhome=\"Yes\"","v":false},null,false]
[null,"CountyScores",null,null,null,null,{"$f":"OR(ComponentVisibility[[#This Row],[Force True]],AND(ComponentVisibility[[#This Row],[Program True]],NOT(ComponentVisibility[[#This Row],[Force False]])))","v":false},"Vissible Sheet if \"TRUE\"",{"$f":"OR(IsCalhome,IsJSerna)","v":false},null,false]
[null,"Document Checklist-Full List",null,null,null,null,{"$f":"OR(ComponentVisibility[[#This Row],[Force True]],AND(ComponentVisibility[[#This Row],[Program True]],NOT(ComponentVisibility[[#This Row],[Force False]])))","v":false},"Vissible Sheet if \"TRUE\"",{"$f":"OR(IsCalhome,IsJSerna)","v":false},null,false]
[null,"Entity Org Docs",null,null,null,null,{"$f":"OR(ComponentVisibility[[#This Row],[Force True]],AND(ComponentVisibility[[#This Row],[Program True]],NOT(ComponentVisibility[[#This Row],[Force False]])))","v":false},"Vissible Sheet if \"TRUE\"",{"$f":"OR(IsCalhome,IsJSerna)","v":false},null,false]
[null,"FWHG Threshold Requiremets",{"$f":"ROW('CalHome Threshold Requirements'!A16)","v":16},{"$f":"ROW('CalHome Threshold Requirements'!A19)","v":19},null,null,{"$f":"OR(ComponentVisibility[[#This Row],[Force True]],AND(ComponentVisibility[[#This Row],[Program True]],NOT(ComponentVisibility[[#This Row],[Force False]])))","v":false},"Vissible Sheet if \"TRUE\"",{"$f":"vmApplicant1Type=\"Local Public Entity\"","v":false},null,false]
[null,"FWHG Threshold Requiremets",{"$f":"ROW('CalHome Threshold Requirements'!A17)","v":17},{"$f":"ROW('CalHome Threshold Requirements'!A17)","v":17},null,null,{"$f":"OR(ComponentVisibility[[#This Row],[Force True]],AND(ComponentVisibility[[#This Row],[Program True]],NOT(ComponentVisibility[[#This Row],[Force False]])))","v":false},"Vissible Sheet if \"TRUE\"",{"$f":"IF(vmApplicant1Type=\"Local Public Entity\",TRUE,FALSE)","v":false},null,false]
[null,"FWHG Threshold Requiremets",{"$f":"ROW('CalHome Threshold Requirements'!A18)","v":18},{"$f":"ROW('CalHome Threshold Requirements'!A18)","v":18},null,null,{"$f":"OR(ComponentVisibility[[#This Row],[Force True]],AND(ComponentVisibility[[#This Row],[Program True]],NOT(ComponentVisibility[[#This Row],[Force False]])))","v":false},"Vissible row(s) if \"TRUE\"",{"$f":"IF(vmApplicant1Type=\"Tribal Entity\",TRUE,FALSE)","v":false},null,false]
[null,"FWHG Threshold Requiremets",{"$f":"ROW('CalHome Threshold Requirements'!A20)","v":20},{"$f":"ROW('CalHome Threshold Requirements'!A28)","v":28},null,null,{"$f":"OR(ComponentVisibility[[#This Row],[Force True]],AND(ComponentVisibility[[#This Row],[Program True]],NOT(ComponentVisibility[[#This Row],[Force False]])))","v":false},"Vissible row(s) if \"TRUE\"",{"$f":"OR(vmApplicant1Type=\"Tribal Entity\",vmApplicant1Type=\"Nonprofit Corporation\",vmApplicant1Type=\"Limited Liability Company\",vmApplicant1Type=\"Limited Partnership\")","v":false},null,false]
[null,"FWHG Threshold Requiremets",{"$f":"ROW('CalHome Threshold Requirements'!A22)","v":22},{"$f":"ROW('CalHome Threshold Requirements'!A25)","v":25},null,null,{"$f":"OR(ComponentVisibility[[#This Row],[Force True]],AND(ComponentVisibility[[#This Row],[Program True]],NOT(ComponentVisibility[[#This Row],[Force False]])))","v":false},"Vissible row(s) if \"TRUE\"",{"$f":"vmJCDO=\"Yes\"","v":false},null,false]
[null,"FWHG Threshold Requiremets",{"$f":"ROW('FWHG Threshold Requiremets'!A27)","v":27},{"$f":"ROW('FWHG Threshold Requiremets'!A27)","v":27},null,null,{"$f":"OR(ComponentVisibility[[#This Row],[Force True]],AND(ComponentVisibility[[#This Row],[Program True]],NOT(ComponentVisibility[[#This Row],[Force False]])))","v":false},"Vissible row(s) if \"TRUE\"",{"$f":"vmJ523SH=\"Yes\"","v":false},null,false]
[null,"FWHG Threshold Requiremets",{"$f":"ROW('FWHG Threshold Requiremets'!A34)","v":34},{"$f":"ROW('FWHG Threshold Requiremets'!A35)","v":35},null,null,{"$f":"OR(ComponentVisibility[[#This Row],[Force True]],AND(ComponentVisibility[[#This Row],[Program True]],NOT(ComponentVisibility[[#This Row],[Force False]])))","v":false},"Vissible row(s) if \"TRUE\"",{"$f":"vmJC2years=\"Yes\"","v":false},null,false]
[null,"FWHG Threshold Requiremets",{"$f":"ROW('CalHome Threshold Requirements'!A36)","v":36},{"$f":"ROW('CalHome Threshold Requirements'!A37)","v":37},null,null,{"$f":"OR(ComponentVisibility[[#This Row],[Force True]],AND(ComponentVisibility[[#This Row],[Program True]],NOT(ComponentVisibility[[#This Row],[Force False]])))","v":false},"Vissible row(s) if \"TRUE\"",{"$f":"vmApplicant1Type=\"Tribal Entity\"","v":false},null,false]
[null,"FWHG Threshold Requiremets",{"$f":"ROW('FWHG Threshold Requiremets'!A39)","v":39},{"$f":"ROW('FWHG Threshold Requiremets'!A45)","v":45},null,null,{"$f":"OR(ComponentVisibility[[#This Row],[Force True]],AND(ComponentVisibility[[#This Row],[Program True]],NOT(ComponentVisibility[[#This Row],[Force False]])))","v":false},"Vissible row(s) if \"TRUE\"",{"$f":"vmJLocalityAS=\"Yes\"","v":false},null,false]
[null,"FWHG Threshold Requiremets",{"$f":"ROW('FWHG Threshold Requiremets'!A47)","v":47},{"$f":"ROW('FWHG Threshold Requiremets'!A48)","v":48},null,null,{"$f":"OR(ComponentVisibility[[#This Row],[Force True]],AND(ComponentVisibility[[#This Row],[Program True]],NOT(ComponentVisibility[[#This Row],[Force False]])))","v":false},"Vissible row(s) if \"TRUE\"",{"$f":"vmJCCA=\"Yes\"","v":false},null,false]
[null,"FWHG Threshold Requiremets",{"$f":"ROW('FWHG Threshold Requiremets'!A50)","v":50},{"$f":"ROW('FWHG Threshold Requiremets'!A55)","v":55},null,null,{"$f":"OR(ComponentVisibility[[#This Row],[Force True]],AND(ComponentVisibility[[#This Row],[Program True]],NOT(ComponentVisibility[[#This Row],[Force False]])))","v":false},"Vissible row(s) if \"TRUE\"",{"$f":"OR(vmApplicant1Type=\"Tribal Entity\",vmApplicant1Type=\"Nonprofit Corporation\",vmApplicant1Type=\"Limited Liability Company\",vmApplicant1Type=\"Limited Partnership\")","v":false},null,false]
[null,"FWHG Threshold Requiremets",{"$f":"ROW('FWHG Threshold Requiremets'!A63)","v":63},{"$f":"ROW('FWHG Threshold Requiremets'!A65)","v":65},null,null,{"$f":"OR(ComponentVisibility[[#This Row],[Force True]],AND(ComponentVisibility[[#This Row],[Program True]],NOT(ComponentVisibility[[#This Row],[Force False]])))","v":false},"Vissible row(s) if \"TRUE\"",{"$f":"vmJRE=\"Yes\"","v":false},null,false]
[null,"FWHG Threshold Requiremets",{"$f":"ROW('FWHG Threshold Requiremets'!A67)","v":67},{"$f":"ROW('FWHG Threshold Requiremets'!A69)","v":69},null,null,{"$f":"OR(ComponentVisibility[[#This Row],[Force True]],AND(ComponentVisibility[[#This Row],[Program True]],NOT(ComponentVisibility[[#This Row],[Force False]])))","v":false},"Vissible row(s) if \"TRUE\"",{"$f":"vmCBDFT=\"Yes\"","v":false},null,false]
[null,"FWHG Threshold Requiremets",{"$f":"ROW('FWHG Threshold Requiremets'!A74)","v":74},{"$f":"ROW('FWHG Threshold Requiremets'!A78)","v":78},null,null,{"$f":"OR(ComponentVisibility[[#This Row],[Force True]],AND(ComponentVisibility[[#This Row],[Program True]],NOT(ComponentVisibility[[#This Row],[Force False]])))","v":false},"Vissible row(s) if \"TRUE\"",{"$f":"vmIsJHDPL=\"Yes\"","v":false},null,false]
[null,"FWHG Threshold Requiremets",{"$f":"ROW('FWHG Threshold Requiremets'!A79)","v":79},{"$f":"ROW('FWHG Threshold Requiremets'!A79)","v":79},null,null,{"$f":"OR(ComponentVisibility[[#This Row],[Force True]],AND(ComponentVisibility[[#This Row],[Program True]],NOT(ComponentVisibility[[#This Row],[Force False]])))","v":false},"Vissible row(s) if \"TRUE\"",{"$f":"vmJWE=\"Yes\"","v":false},null,false]
[null,"FWHG Threshold Requiremets",{"$f":"ROW('FWHG Threshold Requiremets'!A80)","v":80},{"$f":"ROW('FWHG Threshold Requiremets'!A80)","v":80},null,null,{"$f":"OR(ComponentVisibility[[#This Row],[Force True]],AND(ComponentVisibility[[#This Row],[Program True]],NOT(ComponentVisibility[[#This Row],[Force False]])))","v":false},"Vissible row(s) if \"TRUE\"",{"$f":"vmIsJSHTA=\"Yes\"","v":false},null,false]
[null,"FWHG Threshold Requiremets",{"$f":"ROW('FWHG Threshold Requiremets'!A81)","v":81},{"$f":"ROW('FWHG Threshold Requiremets'!A81)","v":81},null,null,{"$f":"OR(ComponentVisibility[[#This Row],[Force True]],AND(ComponentVisibility[[#This Row],[Program True]],NOT(ComponentVisibility[[#This Row],[Force False]])))","v":false},"Vissible row(s) if \"TRUE\"",{"$f":"vmIsJMA=\"Yes\"","v":false},null,false]
[null,"FWHG Threshold Requiremets",{"$f":"ROW('FWHG Threshold Requiremets'!A82)","v":82},{"$f":"ROW('FWHG Threshold Requiremets'!A82)","v":82},null,null,{"$f":"OR(ComponentVisibility[[#This Row],[Force True]],AND(ComponentVisibility[[#This Row],[Program True]],NOT(ComponentVisibility[[#This Row],[Force False]])))","v":false},"Vissible row(s) if \"TRUE\"",{"$f":"vmIsJOOR=\"Yes\"","v":false},null,false]
[null,"FWHG Threshold Requiremets",{"$f":"ROW('FWHG Threshold Requiremets'!A83)","v":83},{"$f":"ROW('FWHG Threshold Requiremets'!A83)","v":83},null,null,{"$f":"OR(ComponentVisibility[[#This Row],[Force True]],AND(ComponentVisibility[[#This Row],[Program True]],NOT(ComponentVisibility[[#This Row],[Force False]])))","v":false},"Vissible row(s) if \"TRUE\"",{"$f":"vmIsJAMH=\"Yes\"","v":false},null,false]
[null,"FWHG Threshold Requiremets",{"$f":"ROW('FWHG Threshold Requiremets'!A88)","v":88},{"$f":"ROW('FWHG Threshold Requiremets'!A88)","v":88},null,null,{"$f":"OR(ComponentVisibility[[#This Row],[Force True]],AND(ComponentVisibility[[#This Row],[Program True]],NOT(ComponentVisibility[[#This Row],[Force False]])))","v":false},"Vissible row(s) if \"TRUE\"",{"$f":"vmIsJHDPL=\"Yes\"","v":false},null,false]
[null,"FWHG Threshold Requiremets",{"$f":"ROW('FWHG Threshold Requiremets'!A89)","v":89},{"$f":"ROW('FWHG Threshold Requiremets'!A89)","v":89},null,null,{"$f":"OR(ComponentVisibility[[#This Row],[Force True]],AND(ComponentVisibility[[#This Row],[Program True]],NOT(ComponentVisibility[[#This Row],[Force False]])))","v":false},"Vissible row(s) if \"TRUE\"",{"$f":"vmIsJSHTA=\"Yes\"","v":false},null,false]
[null,"FWHG Threshold Requiremets",{"$f":"ROW('FWHG Threshold Requiremets'!A90)","v":90},{"$f":"ROW('FWHG Threshold Requiremets'!A90)","v":90},null,null,{"$f":"OR(ComponentVisibility[[#This Row],[Force True]],AND(ComponentVisibility[[#This Row],[Program True]],NOT(ComponentVisibility[[#This Row],[Force False]])))","v":false},"Vissible row(s) if \"TRUE\"",{"$f":"vmIsJMA=\"Yes\"","v":false},null,false]
[null,"FWHG Threshold Requiremets",{"$f":"ROW('FWHG Threshold Requiremets'!A91)","v":91},{"$f":"ROW('FWHG Threshold Requiremets'!A91)","v":91},null,null,{"$f":"OR(ComponentVisibility[[#This Row],[Force True]],AND(ComponentVisibility[[#This Row],[Program True]],NOT(ComponentVisibility[[#This Row],[Force False]])))","v":false},"Vissible row(s) if \"TRUE\"",{"$f":"vmIsJOOR=\"Yes\"","v":false},null,false]
[null,"FWHG Threshold Requiremets",{"$f":"ROW('FWHG Threshold Requiremets'!A92)","v":92},{"$f":"ROW('FWHG Threshold Requiremets'!A92)","v":92},null,null,{"$f":"OR(ComponentVisibility[[#This Row],[Force True]],AND(ComponentVisibility[[#This Row],[Program True]],NOT(ComponentVisibility[[#This Row],[Force False]])))","v":false},"Vissible row(s) if \"TRUE\"",{"$f":"vmIsJAMH=\"Yes\"","v":false},null,false]
[null,"FWHG Threshold Requiremets",{"$f":"ROW('FWHG Threshold Requiremets'!A97)","v":97},{"$f":"ROW('FWHG Threshold Requiremets'!A104)","v":104},null,null,{"$f":"OR(ComponentVisibility[[#This Row],[Force True]],AND(ComponentVisibility[[#This Row],[Program True]],NOT(ComponentVisibility[[#This Row],[Force False]])))","v":false},"Vissible row(s) if \"TRUE\"",{"$f":"vmIsJMA=\"Yes\"","v":false},null,false]
[null,"FWHG Threshold Requiremets",{"$f":"ROW('FWHG Threshold Requiremets'!A105)","v":105},{"$f":"ROW('FWHG Threshold Requiremets'!A112)","v":112},null,null,{"$f":"OR(ComponentVisibility[[#This Row],[Force True]],AND(ComponentVisibility[[#This Row],[Program True]],NOT(ComponentVisibility[[#This Row],[Force False]])))","v":false},"Vissible row(s) if \"TRUE\"",{"$f":"vmIsJOOR=\"Yes\"","v":false},null,false]
[null,"FWHG Threshold Requiremets",{"$f":"ROW('FWHG Threshold Requiremets'!A113)","v":113},{"$f":"ROW('FWHG Threshold Requiremets'!A124)","v":124},null,null,{"$f":"OR(ComponentVisibility[[#This Row],[Force True]],AND(ComponentVisibility[[#This Row],[Program True]],NOT(ComponentVisibility[[#This Row],[Force False]])))","v":false},"Vissible row(s) if \"TRUE\"",{"$f":"vmIsJSHTA=\"Yes\"","v":false},null,false]
[null,"FWHG Threshold Requiremets",{"$f":"ROW('FWHG Threshold Requiremets'!A125)","v":125},{"$f":"ROW('FWHG Threshold Requiremets'!A128)","v":128},null,null,{"$f":"OR(ComponentVisibility[[#This Row],[Force True]],AND(ComponentVisibility[[#This Row],[Program True]],NOT(ComponentVisibility[[#This Row],[Force False]])))","v":false},"Vissible row(s) if \"TRUE\"",{"$f":"vmIsJHDPL=\"Yes\"","v":false},null,false]
[null,"FWHG Threshold Requiremets",{"$f":"ROW('FWHG Threshold Requiremets'!A129)","v":129},{"$f":"ROW('FWHG Threshold Requiremets'!A144)","v":144},null,null,{"$f":"OR(ComponentVisibility[[#This Row],[Force True]],AND(ComponentVisibility[[#This Row],[Program True]],NOT(ComponentVisibility[[#This Row],[Force False]])))","v":false},"Vissible row(s) if \"TRUE\"",{"$f":"vmJ2P=\"Yes\"","v":false},null,false]
[null,"FWHG Threshold Requiremets",{"$f":"ROW('FWHG Threshold Requiremets'!A146)","v":146},{"$f":"ROW('FWHG Threshold Requiremets'!A150)","v":150},null,null,{"$f":"OR(ComponentVisibility[[#This Row],[Force True]],AND(ComponentVisibility[[#This Row],[Program True]],NOT(ComponentVisibility[[#This Row],[Force False]])))","v":false},"Vissible row(s) if \"TRUE\"",{"$f":"vmJHDPLMA=\"Yes\"","v":false},null,false]
[null,"FWHG Threshold Requiremets",{"$f":"ROW('FWHG Threshold Requiremets'!A151)","v":151},{"$f":"ROW('FWHG Threshold Requiremets'!A162)","v":162},null,null,{"$f":"OR(ComponentVisibility[[#This Row],[Force True]],AND(ComponentVisibility[[#This Row],[Program True]],NOT(ComponentVisibility[[#This Row],[Force False]])))","v":false},"Vissible row(s) if \"TRUE\"",{"$f":"vmIsJAMH=\"Yes\"","v":false},null,false]
[null,"FWHG Threshold Requiremets",{"$f":"ROW('FWHG Threshold Requiremets'!A163)","v":163},{"$f":"ROW('FWHG Threshold Requiremets'!A177)","v":177},null,null,{"$f":"OR(ComponentVisibility[[#This Row],[Force True]],AND(ComponentVisibility[[#This Row],[Program True]],NOT(ComponentVisibility[[#This Row],[Force False]])))","v":false},"Vissible row(s) if \"TRUE\"",{"$f":"vmSiteControl2=\"Yes\"","v":false},null,false]
[null,"FWHG Threshold Requiremets",{"$f":"ROW('FWHG Threshold Requiremets'!A171)","v":171},{"$f":"ROW('FWHG Threshold Requiremets'!A174)","v":174},null,null,{"$f":"OR(ComponentVisibility[[#This Row],[Force True]],AND(ComponentVisibility[[#This Row],[Program True]],NOT(ComponentVisibility[[#This Row],[Force False]])))","v":false},"Vissible row(s) if \"TRUE\"",{"$f":"vmGroundLease2=\"Yes\"","v":false},null,false]
[null,"FWHG Threshold Requiremets",{"$f":"ROW('FWHG Threshold Requiremets'!A182)","v":182},{"$f":"ROW('FWHG Threshold Requiremets'!A184)","v":184},null,null,{"$f":"OR(ComponentVisibility[[#This Row],[Force True]],AND(ComponentVisibility[[#This Row],[Program True]],NOT(ComponentVisibility[[#This Row],[Force False]])))","v":false},"Vissible row(s) if \"TRUE\"",{"$f":"IsJHDPL","v":false},null,false]
[null,"FWHG Threshold Requiremets",null,null,{"$f":"COLUMN('FWHG Threshold Requiremets'!AO42)","v":41},{"$f":"COLUMN('FWHG Threshold Requiremets'!AQ42)","v":43},{"$f":"OR(ComponentVisibility[[#This Row],[Force True]],AND(ComponentVisibility[[#This Row],[Program True]],NOT(ComponentVisibility[[#This Row],[Force False]])))","v":false},"Vissible row(s) if \"TRUE\"",{"$f":"AND(SernaTreview=\"Yes\",SernaTreviewR1=\"Yes\")","v":false},null,false]
[null,"FWHG Threshold Requiremets",null,null,{"$f":"COLUMN('FWHG Threshold Requiremets'!AR43)","v":44},{"$f":"COLUMN('FWHG Threshold Requiremets'!AT43)","v":46},{"$f":"OR(ComponentVisibility[[#This Row],[Force True]],AND(ComponentVisibility[[#This Row],[Program True]],NOT(ComponentVisibility[[#This Row],[Force False]])))","v":false},"Vissible row(s) if \"TRUE\"",{"$f":"AND(SernaTreview=\"Yes\",SernaTreviewR2=\"Yes\")","v":false},null,false]
[null,"FWHG Threshold Requiremets",null,null,{"$f":"COLUMN('FWHG Threshold Requiremets'!AU44)","v":47},{"$f":"COLUMN('FWHG Threshold Requiremets'!AW44)","v":49},{"$f":"OR(ComponentVisibility[[#This Row],[Force True]],AND(ComponentVisibility[[#This Row],[Program True]],NOT(ComponentVisibility[[#This Row],[Force False]])))","v":false},"Vissible row(s) if \"TRUE\"",{"$f":"AND(SernaTreview=\"Yes\",SernaTreviewM=\"Yes\")","v":false},null,false]
[null,"FWHG Threshold Requiremets",null,null,null,null,{"$f":"OR(ComponentVisibility[[#This Row],[Force True]],AND(ComponentVisibility[[#This Row],[Program True]],NOT(ComponentVisibility[[#This Row],[Force False]])))","v":false},"Vissible Sheet if \"TRUE\"",{"$f":"vmIsJSerna=\"Yes\"","v":false},null,false]
[null,"Grant-Loan Amount",{"$f":"ROW('Grant-Loan Amount'!A4)","v":4},{"$f":"ROW('Grant-Loan Amount'!A5)","v":5},null,null,{"$f":"OR(ComponentVisibility[[#This Row],[Force True]],AND(ComponentVisibility[[#This Row],[Program True]],NOT(ComponentVisibility[[#This Row],[Force False]])))","v":false},"Vissible row(s) if \"TRUE\"",{"$f":"AND(NOT(IsCalhomeTribal),IsCalhome)","v":false},null,false]
[null,"Grant-Loan Amount",{"$f":"ROW('Grant-Loan Amount'!A6)","v":6},{"$f":"ROW('Grant-Loan Amount'!A6)","v":6},null,null,{"$f":"OR(ComponentVisibility[[#This Row],[Force True]],AND(ComponentVisibility[[#This Row],[Program True]],NOT(ComponentVisibility[[#This Row],[Force False]])))","v":false},"Vissible row(s) if \"TRUE\"",{"$f":"vmMPMHC=\"Yes\"","v":false},null,false]
[null,"Grant-Loan Amount",{"$f":"ROW('Grant-Loan Amount'!A7)","v":7},{"$f":"ROW('Grant-Loan Amount'!A11)","v":11},null,null,{"$f":"OR(ComponentVisibility[[#This Row],[Force True]],AND(ComponentVisibility[[#This Row],[Program True]],NOT(ComponentVisibility[[#This Row],[Force False]])))","v":false},"Vissible row(s) if \"TRUE\"",{"$f":"vmCalHomeMPMHC=\"Both\"","v":false},null,false]
[null,"Grant-Loan Amount",{"$f":"ROW('Grant-Loan Amount'!A12)","v":12},{"$f":"ROW('Grant-Loan Amount'!A13)","v":13},null,null,{"$f":"OR(ComponentVisibility[[#This Row],[Force True]],AND(ComponentVisibility[[#This Row],[Program True]],NOT(ComponentVisibility[[#This Row],[Force False]])))","v":false},"Vissible row(s) if \"TRUE\"",{"$f":"AND(OR(IsCalhome,IsJSerna),vmCBD=\"Yes\")","v":false},null,false]
[null,"Grant-Loan Amount",{"$f":"ROW('Grant-Loan Amount'!A14)","v":14},{"$f":"ROW('Grant-Loan Amount'!A14)","v":14},null,null,{"$f":"OR(ComponentVisibility[[#This Row],[Force True]],AND(ComponentVisibility[[#This Row],[Program True]],NOT(ComponentVisibility[[#This Row],[Force False]])))","v":false},"Vissible row(s) if \"TRUE\"",{"$f":"OR(AND(IsCalhome,IsMA),AND(IsJSerna,IsJMA))","v":false},null,false]
[null,"Grant-Loan Amount",{"$f":"ROW('Grant-Loan Amount'!A19)","v":19},{"$f":"ROW('Grant-Loan Amount'!A19)","v":19},null,null,{"$f":"OR(ComponentVisibility[[#This Row],[Force True]],AND(ComponentVisibility[[#This Row],[Program True]],NOT(ComponentVisibility[[#This Row],[Force False]])))","v":false},"Vissible row(s) if \"TRUE\"",{"$f":"IF(OR(AND(IsCalhome,IsHDPL),AND(IsJSerna,IsJHDPL)),TRUE,FALSE)","v":false},null,false]
[null,"Grant-Loan Amount",{"$f":"ROW('Grant-Loan Amount'!A20)","v":20},{"$f":"ROW('Grant-Loan Amount'!A20)","v":20},null,null,{"$f":"OR(ComponentVisibility[[#This Row],[Force True]],AND(ComponentVisibility[[#This Row],[Program True]],NOT(ComponentVisibility[[#This Row],[Force False]])))","v":false},"Vissible row(s) if \"TRUE\"",{"$f":"IF(OR(AND(IsCalhome,IsSHTA),AND(IsJSerna,IsJSHTA)),TRUE,FALSE)","v":false},null,false]
[null,"Grant-Loan Amount",{"$f":"ROW('Grant-Loan Amount'!A21)","v":21},{"$f":"ROW('Grant-Loan Amount'!A21)","v":21},null,null,{"$f":"OR(ComponentVisibility[[#This Row],[Force True]],AND(ComponentVisibility[[#This Row],[Program True]],NOT(ComponentVisibility[[#This Row],[Force False]])))","v":false},"Vissible row(s) if \"TRUE\"",{"$f":"IF(OR(AND(IsCalhome,IsMA),AND(IsJSerna,IsJMA)),TRUE,FALSE)","v":false},null,false]
[null,"Grant-Loan Amount",{"$f":"ROW('Grant-Loan Amount'!A22)","v":22},{"$f":"ROW('Grant-Loan Amount'!A22)","v":22},null,null,{"$f":"OR(ComponentVisibility[[#This Row],[Force True]],AND(ComponentVisibility[[#This Row],[Program True]],NOT(ComponentVisibility[[#This Row],[Force False]])))","v":false},"Vissible row(s) if \"TRUE\"",{"$f":"IF(OR(AND(IsCalhome,IsOOR),AND(IsJSerna,IsJOOR)),TRUE,FALSE)","v":false},null,false]
[null,"Grant-Loan Amount",{"$f":"ROW('Grant-Loan Amount'!A23)","v":23},{"$f":"ROW('Grant-Loan Amount'!A23)","v":23},null,null,{"$f":"OR(ComponentVisibility[[#This Row],[Force True]],AND(ComponentVisibility[[#This Row],[Program True]],NOT(ComponentVisibility[[#This Row],[Force False]])))","v":false},"Vissible row(s) if \"TRUE\"",{"$f":"IF(AND(IsCalhome,IsSH),TRUE,FALSE)","v":false},null,false]
[null,"Grant-Loan Amount",{"$f":"ROW('Grant-Loan Amount'!A24)","v":24},{"$f":"ROW('Grant-Loan Amount'!A24)","v":24},null,null,{"$f":"OR(ComponentVisibility[[#This Row],[Force True]],AND(ComponentVisibility[[#This Row],[Program True]],NOT(ComponentVisibility[[#This Row],[Force False]])))","v":false},"Vissible row(s) if \"TRUE\"",{"$f":"IF(AND(IsCalhome,IsJADU),TRUE,FALSE)","v":false},null,false]
[null,"Grant-Loan Amount",{"$f":"ROW('Grant-Loan Amount'!A25)","v":25},{"$f":"ROW('Grant-Loan Amount'!A25)","v":25},null,null,{"$f":"OR(ComponentVisibility[[#This Row],[Force True]],AND(ComponentVisibility[[#This Row],[Program True]],NOT(ComponentVisibility[[#This Row],[Force False]])))","v":false},"Vissible row(s) if \"TRUE\"",{"$f":"IF(AND(IsJSerna,IsJAMH),TRUE,FALSE)","v":false},null,false]
[null,"Grant-Loan Amount",null,null,null,null,{"$f":"OR(ComponentVisibility[[#This Row],[Force True]],AND(ComponentVisibility[[#This Row],[Program True]],NOT(ComponentVisibility[[#This Row],[Force False]])))","v":false},"Vissible Sheet if \"TRUE\"",{"$f":"OR(IsCalhome,IsJSerna)","v":false},null,false]
[null,"Grant-Loan Amount",null,null,{"$f":"COLUMN('Grant-Loan Amount'!AQ1)","v":43},{"$f":"COLUMN('Grant-Loan Amount'!AX1)","v":50},{"$f":"OR(ComponentVisibility[[#This Row],[Force True]],AND(ComponentVisibility[[#This Row],[Program True]],NOT(ComponentVisibility[[#This Row],[Force False]])))","v":true},"Vissible Column(s) if \"TRUE\"",{"$f":"OR(vmIsCalhomeTribal=\"No\",vmIsCalhomeTribal=\"\")","v":true},null,false]
[null,"Grant-Loan Amount",null,null,{"$f":"COLUMN('Grant-Loan Amount'!AY1)","v":51},{"$f":"COLUMN('Grant-Loan Amount'!BE1)","v":57},{"$f":"OR(ComponentVisibility[[#This Row],[Force True]],AND(ComponentVisibility[[#This Row],[Program True]],NOT(ComponentVisibility[[#This Row],[Force False]])))","v":false},"Vissible Column(s) if \"TRUE\"",{"$f":"vmIsCalhomeTribal=\"Yes\"","v":false},null,false]
[null,"HDPL Dev Budget SU",null,null,null,null,{"$f":"OR(ComponentVisibility[[#This Row],[Force True]],AND(ComponentVisibility[[#This Row],[Program True]],NOT(ComponentVisibility[[#This Row],[Force False]])))","v":false},"Vissible Sheet if \"TRUE\"",{"$f":"OR(AND(IsCalhome,IsHDPL),AND(IsJSerna,IsJHDPL))","v":false},null,false]
[null,"HDPL Dev Sources",null,null,null,null,{"$f":"OR(ComponentVisibility[[#This Row],[Force True]],AND(ComponentVisibility[[#This Row],[Program True]],NOT(ComponentVisibility[[#This Row],[Force False]])))","v":false},"Vissible Sheet if \"TRUE\"",{"$f":"OR(AND(IsCalhome,IsHDPL),AND(IsJSerna,IsJHDPL))","v":false},null,false]
[null,"HDPL Unit Mix",null,null,null,null,{"$f":"OR(ComponentVisibility[[#This Row],[Force True]],AND(ComponentVisibility[[#This Row],[Program True]],NOT(ComponentVisibility[[#This Row],[Force False]])))","v":false},"Vissible Sheet if \"TRUE\"",{"$f":"OR(AND(IsCalhome,IsHDPL),AND(IsJSerna,IsJHDPL))","v":false},null,false]
[null,"Project Overview",{"$f":"ROW('Project Overview'!A11)","v":11},{"$f":"ROW('Project Overview'!A25)","v":25},null,null,{"$f":"OR(ComponentVisibility[[#This Row],[Force True]],AND(ComponentVisibility[[#This Row],[Program True]],NOT(ComponentVisibility[[#This Row],[Force False]])))","v":true},"Vissible row(s) if \"TRUE\"",{"$f":"OR(vmIsCalhomeTribal=\"No\",vmIsCalhomeTribal=\"\")","v":true},null,false]
[null,"Project Overview",{"$f":"ROW('Project Overview'!A13)","v":13},{"$f":"ROW('Project Overview'!A24)","v":24},null,null,{"$f":"OR(ComponentVisibility[[#This Row],[Force True]],AND(ComponentVisibility[[#This Row],[Program True]],NOT(ComponentVisibility[[#This Row],[Force False]])))","v":false},"Vissible row(s) if \"TRUE\"",{"$f":"vmIsJSerna=\"Yes\"","v":false},null,false]
[null,"Project Overview",{"$f":"ROW('Project Overview'!A15)","v":15},{"$f":"ROW('Project Overview'!A15)","v":15},null,null,{"$f":"OR(ComponentVisibility[[#This Row],[Force True]],AND(ComponentVisibility[[#This Row],[Program True]],NOT(ComponentVisibility[[#This Row],[Force False]])))","v":false},"Vissible row(s) if \"TRUE\"",{"$f":"vmIsJHDPL=\"Yes\"","v":false},null,false]
[null,"Project Overview",{"$f":"ROW('Project Overview'!A18)","v":18},{"$f":"ROW('Project Overview'!A18)","v":18},null,null,{"$f":"OR(ComponentVisibility[[#This Row],[Force True]],AND(ComponentVisibility[[#This Row],[Program True]],NOT(ComponentVisibility[[#This Row],[Force False]])))","v":false},"Vissible row(s) if \"TRUE\"",{"$f":"vmIsJSHTA=\"Yes\"","v":false},null,false]
[null,"Project Overview",{"$f":"ROW('Project Overview'!A29)","v":29},{"$f":"ROW('Project Overview'!A42)","v":42},null,null,{"$f":"OR(ComponentVisibility[[#This Row],[Force True]],AND(ComponentVisibility[[#This Row],[Program True]],NOT(ComponentVisibility[[#This Row],[Force False]])))","v":false},"Vissible row(s) if \"TRUE\"",{"$f":"vmIsCalhome=\"Yes\"","v":false},null,false]
[null,"Project Overview",{"$f":"ROW('Project Overview'!A31)","v":31},{"$f":"ROW('Project Overview'!A31)","v":31},null,null,{"$f":"OR(ComponentVisibility[[#This Row],[Force True]],AND(ComponentVisibility[[#This Row],[Program True]],NOT(ComponentVisibility[[#This Row],[Force False]])))","v":false},"Vissible row(s) if \"TRUE\"",{"$f":"vmIsHDPL=\"Yes\"","v":false},null,false]
[null,"Project Overview",{"$f":"ROW('Project Overview'!A34)","v":34},{"$f":"ROW('Project Overview'!A34)","v":34},null,null,{"$f":"OR(ComponentVisibility[[#This Row],[Force True]],AND(ComponentVisibility[[#This Row],[Program True]],NOT(ComponentVisibility[[#This Row],[Force False]])))","v":false},"Vissible row(s) if \"TRUE\"",{"$f":"vmIsSHTA=\"Yes\"","v":false},null,false]
[null,"Project Overview",{"$f":"ROW('Project Overview'!A49)","v":49},{"$f":"ROW('Project Overview'!A49)","v":49},null,null,{"$f":"OR(ComponentVisibility[[#This Row],[Force True]],AND(ComponentVisibility[[#This Row],[Program True]],NOT(ComponentVisibility[[#This Row],[Force False]])))","v":false},"Vissible row(s) if \"TRUE\"",{"$f":"IF(OR(vmIsJHDPL=\"Yes\",vmIsHDPL=\"Yes\"),TRUE,FALSE)","v":false},null,false]
[null,"Project Overview",{"$f":"ROW('Project Overview'!A54)","v":54},{"$f":"ROW('Project Overview'!A54)","v":54},null,null,{"$f":"OR(ComponentVisibility[[#This Row],[Force True]],AND(ComponentVisibility[[#This Row],[Program True]],NOT(ComponentVisibility[[#This Row],[Force False]])))","v":false},"Vissible row(s) if \"TRUE\"",{"$f":"vmOFS=\"Yes\"","v":false},null,false]
[null,"Project Overview",{"$f":"ROW('Project Overview'!A56)","v":56},{"$f":"ROW('Project Overview'!A56)","v":56},null,null,{"$f":"OR(ComponentVisibility[[#This Row],[Force True]],AND(ComponentVisibility[[#This Row],[Program True]],NOT(ComponentVisibility[[#This Row],[Force False]])))","v":false},"Vissible row(s) if \"TRUE\"",{"$f":"vnPaCompany=\"Yes\"","v":false},null,false]
[null,"Project Overview",{"$f":"ROW('Project Overview'!A58)","v":58},{"$f":"ROW('Project Overview'!A58)","v":58},null,null,{"$f":"OR(ComponentVisibility[[#This Row],[Force True]],AND(ComponentVisibility[[#This Row],[Program True]],NOT(ComponentVisibility[[#This Row],[Force False]])))","v":false},"Vissible row(s) if \"TRUE\"",{"$f":"vmApplicant1Type=\"Tribal Entity\"","v":false},null,false]
[null,"Project Overview",{"$f":"ROW('Project Overview'!A59)","v":59},{"$f":"ROW('Project Overview'!A59)","v":59},null,null,{"$f":"OR(ComponentVisibility[[#This Row],[Force True]],AND(ComponentVisibility[[#This Row],[Program True]],NOT(ComponentVisibility[[#This Row],[Force False]])))","v":false},"Vissible row(s) if \"TRUE\"",{"$f":"IF(AND(vmIsJSerna=\"Yes\",vmApplicant1Type=\"Limited Partnership\"),TRUE,FALSE)","v":false},null,false]
[null,"Project Overview",{"$f":"ROW('Project Overview'!A60)","v":60},{"$f":"ROW('Project Overview'!A60)","v":60},null,null,{"$f":"OR(ComponentVisibility[[#This Row],[Force True]],AND(ComponentVisibility[[#This Row],[Program True]],NOT(ComponentVisibility[[#This Row],[Force False]])))","v":false},"Vissible row(s) if \"TRUE\"",{"$f":"vmIsJSerna=\"Yes\"","v":false},null,false]
[null,"Project Overview",{"$f":"ROW('Project Overview'!A61)","v":61},{"$f":"ROW('Project Overview'!A61)","v":61},null,null,{"$f":"OR(ComponentVisibility[[#This Row],[Force True]],AND(ComponentVisibility[[#This Row],[Program True]],NOT(ComponentVisibility[[#This Row],[Force False]])))","v":false},"Vissible row(s) if \"TRUE\"",{"$f":"IF(OR(vmApplicant1Type=\"Nonprofit Corporation\",vmApplicant1Type=\"Limited Liability Company\",vmApplicant1Type=\"Limited Partnership\"),TRUE,FALSE)","v":false},null,false]
[null,"Project Overview",{"$f":"ROW('Project Overview'!A62)","v":62},{"$f":"ROW('Project Overview'!A62)","v":62},null,null,{"$f":"OR(ComponentVisibility[[#This Row],[Force True]],AND(ComponentVisibility[[#This Row],[Program True]],NOT(ComponentVisibility[[#This Row],[Force False]])))","v":false},"Vissible row(s) if \"TRUE\"",{"$f":"vmPCompany=\"Yes\"","v":false},null,false]
[null,"Project Overview",{"$f":"ROW('Project Overview'!A73)","v":73},{"$f":"ROW('Project Overview'!A88)","v":88},null,null,{"$f":"OR(ComponentVisibility[[#This Row],[Force True]],AND(ComponentVisibility[[#This Row],[Program True]],NOT(ComponentVisibility[[#This Row],[Force False]])))","v":false},"Vissible row(s) if \"TRUE\"",{"$f":"vmCNonprofit=\"Yes\"","v":false},null,false]
[null,"Project Overview",{"$f":"ROW('Project Overview'!A89)","v":89},{"$f":"ROW('Project Overview'!A90)","v":90},null,null,{"$f":"OR(ComponentVisibility[[#This Row],[Force True]],AND(ComponentVisibility[[#This Row],[Program True]],NOT(ComponentVisibility[[#This Row],[Force False]])))","v":false},"Vissible row(s) if \"TRUE\"",{"$f":"vmApplicant1Type=\"Limited Partnership\"","v":false},null,false]
[null,"Project Overview",{"$f":"ROW('Project Overview'!A97)","v":97},{"$f":"ROW('Project Overview'!A100)","v":100},null,null,{"$f":"OR(ComponentVisibility[[#This Row],[Force True]],AND(ComponentVisibility[[#This Row],[Program True]],NOT(ComponentVisibility[[#This Row],[Force False]])))","v":false},"Vissible row(s) if \"TRUE\"",{"$f":"AND(IsCalhome,IsHDPL)","v":false},null,false]
[null,"Project Overview",{"$f":"ROW('Project Overview'!A101)","v":101},{"$f":"ROW('Project Overview'!A102)","v":102},null,null,{"$f":"OR(ComponentVisibility[[#This Row],[Force True]],AND(ComponentVisibility[[#This Row],[Program True]],NOT(ComponentVisibility[[#This Row],[Force False]])))","v":false},"Vissible row(s) if \"TRUE\"",{"$f":"vmRural6=\"Yes\"","v":false},null,false]
[null,"Project Overview",{"$f":"ROW('Project Overview'!A103)","v":103},{"$f":"ROW('Project Overview'!A105)","v":105},null,null,{"$f":"OR(ComponentVisibility[[#This Row],[Force True]],AND(ComponentVisibility[[#This Row],[Program True]],NOT(ComponentVisibility[[#This Row],[Force False]])))","v":false},"Vissible row(s) if \"TRUE\"",{"$f":"AND(IsCalhome,IsHDPL)","v":false},null,false]
[null,"Project Overview",{"$f":"ROW('Project Overview'!A106)","v":106},{"$f":"ROW('Project Overview'!A109)","v":109},null,null,{"$f":"OR(ComponentVisibility[[#This Row],[Force True]],AND(ComponentVisibility[[#This Row],[Program True]],NOT(ComponentVisibility[[#This Row],[Force False]])))","v":false},"Vissible row(s) if \"TRUE\"",{"$f":"AND(IsJSerna,IsJHDPL)","v":false},null,false]
[null,"Project Overview",{"$f":"ROW('Project Overview'!A110)","v":110},{"$f":"ROW('Project Overview'!A111)","v":111},null,null,{"$f":"OR(ComponentVisibility[[#This Row],[Force True]],AND(ComponentVisibility[[#This Row],[Program True]],NOT(ComponentVisibility[[#This Row],[Force False]])))","v":false},"Vissible row(s) if \"TRUE\"",{"$f":"vmRural=\"Yes\"","v":false},null,false]
[null,"Project Overview",{"$f":"ROW('Project Overview'!A112)","v":112},{"$f":"ROW('Project Overview'!A114)","v":114},null,null,{"$f":"OR(ComponentVisibility[[#This Row],[Force True]],AND(ComponentVisibility[[#This Row],[Program True]],NOT(ComponentVisibility[[#This Row],[Force False]])))","v":false},"Vissible row(s) if \"TRUE\"",{"$f":"AND(IsJSerna,IsJHDPL)","v":false},null,false]
[null,"Project Overview",{"$f":"ROW('Project Overview'!A115)","v":115},{"$f":"ROW('Project Overview'!A118)","v":118},null,null,{"$f":"OR(ComponentVisibility[[#This Row],[Force True]],AND(ComponentVisibility[[#This Row],[Program True]],NOT(ComponentVisibility[[#This Row],[Force False]])))","v":false},"Vissible row(s) if \"TRUE\"",{"$f":"AND(IsCalhome,IsSHTA)","v":false},null,false]
[null,"Project Overview",{"$f":"ROW('Project Overview'!A119)","v":119},{"$f":"ROW('Project Overview'!A120)","v":120},null,null,{"$f":"OR(ComponentVisibility[[#This Row],[Force True]],AND(ComponentVisibility[[#This Row],[Program True]],NOT(ComponentVisibility[[#This Row],[Force False]])))","v":false},"Vissible row(s) if \"TRUE\"",{"$f":"vmRural7=\"Yes\"","v":false},null,false]
[null,"Project Overview",{"$f":"ROW('Project Overview'!A121)","v":121},{"$f":"ROW('Project Overview'!A123)","v":123},null,null,{"$f":"OR(ComponentVisibility[[#This Row],[Force True]],AND(ComponentVisibility[[#This Row],[Program True]],NOT(ComponentVisibility[[#This Row],[Force False]])))","v":false},"Vissible row(s) if \"TRUE\"",{"$f":"AND(IsCalhome,IsSHTA)","v":false},null,false]
[null,"Project Overview",{"$f":"ROW('Project Overview'!A124)","v":124},{"$f":"ROW('Project Overview'!A127)","v":127},null,null,{"$f":"OR(ComponentVisibility[[#This Row],[Force True]],AND(ComponentVisibility[[#This Row],[Program True]],NOT(ComponentVisibility[[#This Row],[Force False]])))","v":false},"Vissible row(s) if \"TRUE\"",{"$f":"AND(IsJSerna,IsJSHTA)","v":false},null,false]
[null,"Project Overview",{"$f":"ROW('Project Overview'!A128)","v":128},{"$f":"ROW('Project Overview'!A129)","v":129},null,null,{"$f":"OR(ComponentVisibility[[#This Row],[Force True]],AND(ComponentVisibility[[#This Row],[Program True]],NOT(ComponentVisibility[[#This Row],[Force False]])))","v":false},"Vissible row(s) if \"TRUE\"",{"$f":"vmRural2=\"Yes\"","v":false},null,false]
[null,"Project Overview",{"$f":"ROW('Project Overview'!A130)","v":130},{"$f":"ROW('Project Overview'!A132)","v":132},null,null,{"$f":"OR(ComponentVisibility[[#This Row],[Force True]],AND(ComponentVisibility[[#This Row],[Program True]],NOT(ComponentVisibility[[#This Row],[Force False]])))","v":false},"Vissible row(s) if \"TRUE\"",{"$f":"AND(IsJSerna,IsJSHTA)","v":false},null,false]
[null,"Project Overview",{"$f":"ROW('Project Overview'!A133)","v":133},{"$f":"ROW('Project Overview'!A136)","v":136},null,null,{"$f":"OR(ComponentVisibility[[#This Row],[Force True]],AND(ComponentVisibility[[#This Row],[Program True]],NOT(ComponentVisibility[[#This Row],[Force False]])))","v":false},"Vissible row(s) if \"TRUE\"",{"$f":"AND(IsCalhome,IsMA)","v":false},null,false]
[null,"Project Overview",{"$f":"ROW('Project Overview'!A137)","v":137},{"$f":"ROW('Project Overview'!A138)","v":138},null,null,{"$f":"OR(ComponentVisibility[[#This Row],[Force True]],AND(ComponentVisibility[[#This Row],[Program True]],NOT(ComponentVisibility[[#This Row],[Force False]])))","v":false},"Vissible row(s) if \"TRUE\"",{"$f":"vmRural8=\"Yes\"","v":false},null,false]
[null,"Project Overview",{"$f":"ROW('Project Overview'!A139)","v":139},{"$f":"ROW('Project Overview'!A141)","v":141},null,null,{"$f":"OR(ComponentVisibility[[#This Row],[Force True]],AND(ComponentVisibility[[#This Row],[Program True]],NOT(ComponentVisibility[[#This Row],[Force False]])))","v":false},"Vissible row(s) if \"TRUE\"",{"$f":"AND(IsCalhome,IsMA)","v":false},null,false]
[null,"Project Overview",{"$f":"ROW('Project Overview'!A142)","v":142},{"$f":"ROW('Project Overview'!A145)","v":145},null,null,{"$f":"OR(ComponentVisibility[[#This Row],[Force True]],AND(ComponentVisibility[[#This Row],[Program True]],NOT(ComponentVisibility[[#This Row],[Force False]])))","v":false},"Vissible row(s) if \"TRUE\"",{"$f":"AND(IsJSerna,IsJMA)","v":false},null,false]
[null,"Project Overview",{"$f":"ROW('Project Overview'!A146)","v":146},{"$f":"ROW('Project Overview'!A147)","v":147},null,null,{"$f":"OR(ComponentVisibility[[#This Row],[Force True]],AND(ComponentVisibility[[#This Row],[Program True]],NOT(ComponentVisibility[[#This Row],[Force False]])))","v":false},"Vissible row(s) if \"TRUE\"",{"$f":"vmRural3=\"Yes\"","v":false},null,false]
[null,"Project Overview",{"$f":"ROW('Project Overview'!A148)","v":148},{"$f":"ROW('Project Overview'!A150)","v":150},null,null,{"$f":"OR(ComponentVisibility[[#This Row],[Force True]],AND(ComponentVisibility[[#This Row],[Program True]],NOT(ComponentVisibility[[#This Row],[Force False]])))","v":false},"Vissible row(s) if \"TRUE\"",{"$f":"AND(IsJSerna,IsJMA)","v":false},null,false]
[null,"Project Overview",{"$f":"ROW('Project Overview'!A151)","v":151},{"$f":"ROW('Project Overview'!A154)","v":154},null,null,{"$f":"OR(ComponentVisibility[[#This Row],[Force True]],AND(ComponentVisibility[[#This Row],[Program True]],NOT(ComponentVisibility[[#This Row],[Force False]])))","v":false},"Vissible row(s) if \"TRUE\"",{"$f":"AND(IsCalhome,IsOOR)","v":false},null,false]
[null,"Project Overview",{"$f":"ROW('Project Overview'!A155)","v":155},{"$f":"ROW('Project Overview'!A156)","v":156},null,null,{"$f":"OR(ComponentVisibility[[#This Row],[Force True]],AND(ComponentVisibility[[#This Row],[Program True]],NOT(ComponentVisibility[[#This Row],[Force False]])))","v":false},"Vissible row(s) if \"TRUE\"",{"$f":"vmRural9=\"Yes\"","v":false},null,false]
[null,"Project Overview",{"$f":"ROW('Project Overview'!A157)","v":157},{"$f":"ROW('Project Overview'!A159)","v":159},null,null,{"$f":"OR(ComponentVisibility[[#This Row],[Force True]],AND(ComponentVisibility[[#This Row],[Program True]],NOT(ComponentVisibility[[#This Row],[Force False]])))","v":false},"Vissible row(s) if \"TRUE\"",{"$f":"AND(IsCalhome,IsOOR)","v":false},null,false]
[null,"Project Overview",{"$f":"ROW('Project Overview'!A160)","v":160},{"$f":"ROW('Project Overview'!A163)","v":163},null,null,{"$f":"OR(ComponentVisibility[[#This Row],[Force True]],AND(ComponentVisibility[[#This Row],[Program True]],NOT(ComponentVisibility[[#This Row],[Force False]])))","v":false},"Vissible row(s) if \"TRUE\"",{"$f":"AND(IsJSerna,IsJOOR)","v":false},null,false]
[null,"Project Overview",{"$f":"ROW('Project Overview'!A164)","v":164},{"$f":"ROW('Project Overview'!A165)","v":165},null,null,{"$f":"OR(ComponentVisibility[[#This Row],[Force True]],AND(ComponentVisibility[[#This Row],[Program True]],NOT(ComponentVisibility[[#This Row],[Force False]])))","v":false},"Vissible row(s) if \"TRUE\"",{"$f":"vmRural4=\"Yes\"","v":false},null,false]
[null,"Project Overview",{"$f":"ROW('Project Overview'!A166)","v":166},{"$f":"ROW('Project Overview'!A168)","v":168},null,null,{"$f":"OR(ComponentVisibility[[#This Row],[Force True]],AND(ComponentVisibility[[#This Row],[Program True]],NOT(ComponentVisibility[[#This Row],[Force False]])))","v":false},"Vissible row(s) if \"TRUE\"",{"$f":"AND(IsJSerna,IsJOOR)","v":false},null,false]
[null,"Project Overview",{"$f":"ROW('Project Overview'!A169)","v":169},{"$f":"ROW('Project Overview'!A171)","v":171},null,null,{"$f":"OR(ComponentVisibility[[#This Row],[Force True]],AND(ComponentVisibility[[#This Row],[Program True]],NOT(ComponentVisibility[[#This Row],[Force False]])))","v":false},"Vissible row(s) if \"TRUE\"",{"$f":"AND(IsCalhome,IsSH)","v":false},null,false]
[null,"Project Overview",{"$f":"ROW('Project Overview'!A172)","v":172},{"$f":"ROW('Project Overview'!A174)","v":174},null,null,{"$f":"OR(ComponentVisibility[[#This Row],[Force True]],AND(ComponentVisibility[[#This Row],[Program True]],NOT(ComponentVisibility[[#This Row],[Force False]])))","v":false},"Vissible row(s) if \"TRUE\"",{"$f":"IF(AND(IsCalhome,IsSH),TRUE,FALSE)","v":false},null,false]
[null,"Project Overview",{"$f":"ROW('Project Overview'!A175)","v":175},{"$f":"ROW('Project Overview'!A178)","v":178},null,null,{"$f":"OR(ComponentVisibility[[#This Row],[Force True]],AND(ComponentVisibility[[#This Row],[Program True]],NOT(ComponentVisibility[[#This Row],[Force False]])))","v":false},"Vissible row(s) if \"TRUE\"",{"$f":"AND(IsCalhome,IsJADU)","v":false},null,false]
[null,"Project Overview",{"$f":"ROW('Project Overview'!A179)","v":179},{"$f":"ROW('Project Overview'!A180)","v":180},null,null,{"$f":"OR(ComponentVisibility[[#This Row],[Force True]],AND(ComponentVisibility[[#This Row],[Program True]],NOT(ComponentVisibility[[#This Row],[Force False]])))","v":false},"Vissible row(s) if \"TRUE\"",{"$f":"vmRural11=\"Yes\"","v":false},null,false]
[null,"Project Overview",{"$f":"ROW('Project Overview'!A181)","v":181},{"$f":"ROW('Project Overview'!A183)","v":183},null,null,{"$f":"OR(ComponentVisibility[[#This Row],[Force True]],AND(ComponentVisibility[[#This Row],[Program True]],NOT(ComponentVisibility[[#This Row],[Force False]])))","v":false},"Vissible row(s) if \"TRUE\"",{"$f":"IF(AND(IsCalhome,IsJADU),TRUE,FALSE)","v":false},null,false]
[null,"Project Overview",{"$f":"ROW('Project Overview'!A184)","v":184},{"$f":"ROW('Project Overview'!A187)","v":187},null,null,{"$f":"OR(ComponentVisibility[[#This Row],[Force True]],AND(ComponentVisibility[[#This Row],[Program True]],NOT(ComponentVisibility[[#This Row],[Force False]])))","v":false},"Vissible row(s) if \"TRUE\"",{"$f":"AND(IsJSerna,IsJAMH)","v":false},null,false]
[null,"Project Overview",{"$f":"ROW('Project Overview'!A188)","v":188},{"$f":"ROW('Project Overview'!A189)","v":189},null,null,{"$f":"OR(ComponentVisibility[[#This Row],[Force True]],AND(ComponentVisibility[[#This Row],[Program True]],NOT(ComponentVisibility[[#This Row],[Force False]])))","v":false},"Vissible row(s) if \"TRUE\"",{"$f":"vmRural5=\"Yes\"","v":false},null,false]
[null,"Project Overview",{"$f":"ROW('Project Overview'!A190)","v":190},{"$f":"ROW('Project Overview'!A192)","v":192},null,null,{"$f":"OR(ComponentVisibility[[#This Row],[Force True]],AND(ComponentVisibility[[#This Row],[Program True]],NOT(ComponentVisibility[[#This Row],[Force False]])))","v":false},"Vissible row(s) if \"TRUE\"",{"$f":"IF(AND(IsJSerna,IsJAMH),TRUE,FALSE)","v":false},null,false]
[null,"Project Overview",{"$f":"ROW('Project Overview'!A193)","v":193},{"$f":"ROW('Project Overview'!A193)","v":193},null,null,{"$f":"OR(ComponentVisibility[[#This Row],[Force True]],AND(ComponentVisibility[[#This Row],[Program True]],NOT(ComponentVisibility[[#This Row],[Force False]])))","v":false},"Vissible row(s) if \"TRUE\"",{"$f":"OR(vmIsHDPL=\"Yes\",vmIsJHDPL=\"Yes\",vmIsSHTA=\"Yes\",vmIsJSHTA=\"Yes\")","v":false},null,false]
[null,"Project Overview",{"$f":"ROW('Project Overview'!A194)","v":194},{"$f":"ROW('Project Overview'!A195)","v":195},null,null,{"$f":"OR(ComponentVisibility[[#This Row],[Force True]],AND(ComponentVisibility[[#This Row],[Program True]],NOT(ComponentVisibility[[#This Row],[Force False]])))","v":false},"Vissible row(s) if \"TRUE\"",{"$f":"vmCBDFT=\"Yes\"","v":false},null,false]
[null,"Project Overview",{"$f":"ROW('Project Overview'!A196)","v":196},{"$f":"ROW('Project Overview'!A199)","v":199},null,null,{"$f":"OR(ComponentVisibility[[#This Row],[Force True]],AND(ComponentVisibility[[#This Row],[Program True]],NOT(ComponentVisibility[[#This Row],[Force False]])))","v":false},"Vissible row(s) if \"TRUE\"",{"$f":"vmApplicant1Type=\"Tribal Entity\"","v":false},null,false]
[null,"Project Overview",{"$f":"ROW('Project Overview'!A200)","v":200},{"$f":"ROW('Project Overview'!A200)","v":200},null,null,{"$f":"OR(ComponentVisibility[[#This Row],[Force True]],AND(ComponentVisibility[[#This Row],[Program True]],NOT(ComponentVisibility[[#This Row],[Force False]])))","v":false},"Vissible row(s) if \"TRUE\"",{"$f":"vmIndianCountry=\"Indian Country\"","v":false},null,false]
[null,"Project Overview",{"$f":"ROW('Project Overview'!A201)","v":201},{"$f":"ROW('Project Overview'!A201)","v":201},null,null,{"$f":"OR(ComponentVisibility[[#This Row],[Force True]],AND(ComponentVisibility[[#This Row],[Program True]],NOT(ComponentVisibility[[#This Row],[Force False]])))","v":false},"Vissible row(s) if \"TRUE\"",{"$f":"vmIndianCountry=\"Fee Land\"","v":false},null,false]
[null,"Project Overview",{"$f":"ROW('Project Overview'!A203)","v":203},{"$f":"ROW('Project Overview'!A203)","v":203},null,null,{"$f":"OR(ComponentVisibility[[#This Row],[Force True]],AND(ComponentVisibility[[#This Row],[Program True]],NOT(ComponentVisibility[[#This Row],[Force False]])))","v":false},"Vissible row(s) if \"TRUE\"",{"$f":"vmCBD=\"Yes\"","v":false},null,false]
[null,"Project Overview",{"$f":"ROW('Project Overview'!A204)","v":204},{"$f":"ROW('Project Overview'!A222)","v":222},null,null,{"$f":"OR(ComponentVisibility[[#This Row],[Force True]],AND(ComponentVisibility[[#This Row],[Program True]],NOT(ComponentVisibility[[#This Row],[Force False]])))","v":false},"Vissible row(s) if \"TRUE\"",{"$f":"vmCBD2=\"Yes\"","v":false},null,false]
[null,"Project Overview",{"$f":"ROW('Project Overview'!A232)","v":232},{"$f":"ROW('Project Overview'!A234)","v":234},null,null,{"$f":"OR(ComponentVisibility[[#This Row],[Force True]],AND(ComponentVisibility[[#This Row],[Program True]],NOT(ComponentVisibility[[#This Row],[Force False]])))","v":false},"Vissible row(s) if \"TRUE\"",{"$f":"vmApplicant1Type=\"Tribal Entity\"","v":false},null,false]
[null,"Project Overview",{"$f":"ROW('Project Overview'!A236)","v":236},{"$f":"ROW('Project Overview'!A236)","v":236},null,null,{"$f":"OR(ComponentVisibility[[#This Row],[Force True]],AND(ComponentVisibility[[#This Row],[Program True]],NOT(ComponentVisibility[[#This Row],[Force False]])))","v":false},"Vissible row(s) if \"TRUE\"",{"$f":"vmTpp=\"Yes\"","v":false},null,false]
[null,"Project Overview",{"$f":"ROW('Project Overview'!A238)","v":238},{"$f":"ROW('Project Overview'!A258)","v":258},null,null,{"$f":"OR(ComponentVisibility[[#This Row],[Force True]],AND(ComponentVisibility[[#This Row],[Program True]],NOT(ComponentVisibility[[#This Row],[Force False]])))","v":false},"Vissible row(s) if \"TRUE\"",{"$f":"OR(AND(IsCalhome,vmIsMA=\"Yes\"),AND(IsJSerna,vmIsJMA=\"Yes\"))","v":false},null,false]
[null,"Project Overview",{"$f":"ROW('Project Overview'!A261)","v":261},{"$f":"ROW('Project Overview'!A263)","v":263},null,null,{"$f":"OR(ComponentVisibility[[#This Row],[Force True]],AND(ComponentVisibility[[#This Row],[Program True]],NOT(ComponentVisibility[[#This Row],[Force False]])))","v":false},"Vissible row(s) if \"TRUE\"",{"$f":"OR(AND(IsCalhome,vmIsHDPL=\"Yes\"),AND(IsJSerna,vmIsJHDPL=\"Yes\"))","v":false},null,false]
[null,"Project Overview",{"$f":"ROW('Project Overview'!A264)","v":264},{"$f":"ROW('Project Overview'!A265)","v":265},null,null,{"$f":"OR(ComponentVisibility[[#This Row],[Force True]],AND(ComponentVisibility[[#This Row],[Program True]],NOT(ComponentVisibility[[#This Row],[Force False]])))","v":false},"Vissible row(s) if \"TRUE\"",{"$f":"vmRelocation=\"Yes\"","v":false},null,false]
[null,"Project Overview",{"$f":"ROW('Project Overview'!A266)","v":266},{"$f":"ROW('Project Overview'!A267)","v":267},null,null,{"$f":"OR(ComponentVisibility[[#This Row],[Force True]],AND(ComponentVisibility[[#This Row],[Program True]],NOT(ComponentVisibility[[#This Row],[Force False]])))","v":false},"Vissible row(s) if \"TRUE\"",{"$f":"vmRelocation=\"No\"","v":false},null,false]
[null,"Project Overview",{"$f":"ROW('Project Overview'!A268)","v":268},{"$f":"ROW('Project Overview'!A269)","v":269},null,null,{"$f":"OR(ComponentVisibility[[#This Row],[Force True]],AND(ComponentVisibility[[#This Row],[Program True]],NOT(ComponentVisibility[[#This Row],[Force False]])))","v":false},"Vissible row(s) if \"TRUE\"",{"$f":"OR(AND(IsCalhome,vmIsHDPL=\"Yes\"),AND(IsJSerna,vmIsJHDPL=\"Yes\"))","v":false},null,false]
[null,"Project Overview",{"$f":"ROW('Project Overview'!A271)","v":271},{"$f":"ROW('Project Overview'!A279)","v":279},null,null,{"$f":"OR(ComponentVisibility[[#This Row],[Force True]],AND(ComponentVisibility[[#This Row],[Program True]],NOT(ComponentVisibility[[#This Row],[Force False]])))","v":false},"Vissible row(s) if \"TRUE\"",{"$f":"OR(AND(IsCalhome,OR(vmIsMA=\"Yes\",vmIsOOR=\"Yes\",vmIsJADU=\"Yes\")),AND(IsJSerna,OR(vmIsJMA=\"Yes\",vmIsJOOR=\"Yes\",vmIsJAMH=\"Yes\")))","v":false},null,false]
[null,"Project Overview",{"$f":"ROW('Project Overview'!A282)","v":282},{"$f":"ROW('Project Overview'!A334)","v":334},null,null,{"$f":"OR(ComponentVisibility[[#This Row],[Force True]],AND(ComponentVisibility[[#This Row],[Program True]],NOT(ComponentVisibility[[#This Row],[Force False]])))","v":false},"Vissible row(s) if \"TRUE\"",{"$f":"OR(AND(IsCalhome,vmIsHDPL=\"Yes\"),AND(IsJSerna,vmIsJHDPL=\"Yes\"))","v":false},null,false]
[null,"Project Overview",{"$f":"ROW('Project Overview'!A289)","v":289},{"$f":"ROW('Project Overview'!A305)","v":305},null,null,{"$f":"OR(ComponentVisibility[[#This Row],[Force True]],AND(ComponentVisibility[[#This Row],[Program True]],NOT(ComponentVisibility[[#This Row],[Force False]])))","v":false},"Vissible row(s) if \"TRUE\"",{"$f":"AND(IsJSerna,vmIsJHDPL=\"Yes\")","v":false},null,false]
[null,"Project Overview",{"$f":"ROW('Project Overview'!A290)","v":290},{"$f":"ROW('Project Overview'!A296)","v":296},null,null,{"$f":"OR(ComponentVisibility[[#This Row],[Force True]],AND(ComponentVisibility[[#This Row],[Program True]],NOT(ComponentVisibility[[#This Row],[Force False]])))","v":false},"Vissible row(s) if \"TRUE\"",{"$f":"vmSiteControlFWHG=\"Yes\"","v":false},null,false]
[null,"Project Overview",{"$f":"ROW('Project Overview'!A298)","v":298},{"$f":"ROW('Project Overview'!A301)","v":301},null,null,{"$f":"OR(ComponentVisibility[[#This Row],[Force True]],AND(ComponentVisibility[[#This Row],[Program True]],NOT(ComponentVisibility[[#This Row],[Force False]])))","v":false},"Vissible row(s) if \"TRUE\"",{"$f":"vmGroundLeaseFWHG=\"Yes\"","v":false},null,false]
[null,"Project Overview",{"$f":"ROW('Project Overview'!A306)","v":306},{"$f":"ROW('Project Overview'!A322)","v":322},null,null,{"$f":"OR(ComponentVisibility[[#This Row],[Force True]],AND(ComponentVisibility[[#This Row],[Program True]],NOT(ComponentVisibility[[#This Row],[Force False]])))","v":false},"Vissible row(s) if \"TRUE\"",{"$f":"AND(IsCalhome,vmIsHDPL=\"Yes\")","v":false},null,false]
[null,"Project Overview",{"$f":"ROW('Project Overview'!A307)","v":307},{"$f":"ROW('Project Overview'!A313)","v":313},null,null,{"$f":"OR(ComponentVisibility[[#This Row],[Force True]],AND(ComponentVisibility[[#This Row],[Program True]],NOT(ComponentVisibility[[#This Row],[Force False]])))","v":false},"Vissible row(s) if \"TRUE\"",{"$f":"vmSiteControl=\"Yes\"","v":false},null,false]
[null,"Project Overview",{"$f":"ROW('Project Overview'!A315)","v":315},{"$f":"ROW('Project Overview'!A316)","v":316},null,null,{"$f":"OR(ComponentVisibility[[#This Row],[Force True]],AND(ComponentVisibility[[#This Row],[Program True]],NOT(ComponentVisibility[[#This Row],[Force False]])))","v":false},"Vissible row(s) if \"TRUE\"",{"$f":"vmGroundLease=\"Yes\"","v":false},null,false]
[null,"Project Overview",{"$f":"ROW('Project Overview'!A335)","v":335},{"$f":"ROW('Project Overview'!A343)","v":343},null,null,{"$f":"OR(ComponentVisibility[[#This Row],[Force True]],AND(ComponentVisibility[[#This Row],[Program True]],NOT(ComponentVisibility[[#This Row],[Force False]])))","v":false},"Vissible row(s) if \"TRUE\"",{"$f":"OR(AND(IsCalhome,vmIsSHTA=\"Yes\"),AND(IsJSerna,vmIsJSHTA=\"Yes\"))","v":false},null,false]
[null,"Project Overview",{"$f":"ROW('Project Overview'!A344)","v":344},{"$f":"ROW('Project Overview'!A354)","v":354},null,null,{"$f":"OR(ComponentVisibility[[#This Row],[Force True]],AND(ComponentVisibility[[#This Row],[Program True]],NOT(ComponentVisibility[[#This Row],[Force False]])))","v":false},"Vissible row(s) if \"TRUE\"",{"$f":"OR(AND(IsCalhome,vmIsMA=\"Yes\"),AND(IsJSerna,vmIsJMA=\"Yes\"))","v":false},null,false]
[null,"Project Overview",{"$f":"ROW('Project Overview'!A355)","v":355},{"$f":"ROW('Project Overview'!A365)","v":365},null,null,{"$f":"OR(ComponentVisibility[[#This Row],[Force True]],AND(ComponentVisibility[[#This Row],[Program True]],NOT(ComponentVisibility[[#This Row],[Force False]])))","v":false},"Vissible row(s) if \"TRUE\"",{"$f":"OR(AND(IsCalhome,vmIsOOR=\"Yes\"),AND(IsJSerna,vmIsJOOR=\"Yes\"))","v":false},null,false]
[null,"Project Overview",{"$f":"ROW('Project Overview'!A366)","v":366},{"$f":"ROW('Project Overview'!A372)","v":372},null,null,{"$f":"OR(ComponentVisibility[[#This Row],[Force True]],AND(ComponentVisibility[[#This Row],[Program True]],NOT(ComponentVisibility[[#This Row],[Force False]])))","v":false},"Vissible row(s) if \"TRUE\"",{"$f":"AND(IsCalhome,vmIsSH=\"Yes\")","v":false},null,false]
[null,"Project Overview",{"$f":"ROW('Project Overview'!A373)","v":373},{"$f":"ROW('Project Overview'!A382)","v":382},null,null,{"$f":"OR(ComponentVisibility[[#This Row],[Force True]],AND(ComponentVisibility[[#This Row],[Program True]],NOT(ComponentVisibility[[#This Row],[Force False]])))","v":false},"Vissible row(s) if \"TRUE\"",{"$f":"AND(IsJSerna,vmIsJAMH=\"Yes\")","v":false},null,false]
[null,"Project Overview",{"$f":"ROW('Project Overview'!A383)","v":383},{"$f":"ROW('Project Overview'!A392)","v":392},null,null,{"$f":"OR(ComponentVisibility[[#This Row],[Force True]],AND(ComponentVisibility[[#This Row],[Program True]],NOT(ComponentVisibility[[#This Row],[Force False]])))","v":false},"Vissible row(s) if \"TRUE\"",{"$f":"AND(IsCalhome,vmIsJADU=\"Yes\")","v":false},null,false]
[null,"Project Overview",{"$f":"ROW('Project Overview'!A423)","v":423},{"$f":"ROW('Project Overview'!A433)","v":433},null,null,{"$f":"OR(ComponentVisibility[[#This Row],[Force True]],AND(ComponentVisibility[[#This Row],[Program True]],NOT(ComponentVisibility[[#This Row],[Force False]])))","v":false},"Vissible row(s) if \"TRUE\"",{"$f":"OR(AND(IsCalhome,vmIsHDPL=\"Yes\"),AND(IsJSerna,vmIsJHDPL=\"Yes\"))","v":false},null,false]
[null,"HOSN Scoring",{"$f":"ROW('HOSN Scoring'!A13)","v":13},{"$f":"ROW('HOSN Scoring'!A21)","v":21},null,null,{"$f":"OR(ComponentVisibility[[#This Row],[Force True]],AND(ComponentVisibility[[#This Row],[Program True]],NOT(ComponentVisibility[[#This Row],[Force False]])))","v":false},"Vissible row(s) if \"TRUE\"",{"$f":"vmIsJSerna=\"Yes\"","v":false},null,false]
[null,"HOSN Scoring",{"$f":"ROW('HOSN Scoring'!A16)","v":16},{"$f":"ROW('HOSN Scoring'!A16)","v":16},null,null,{"$f":"OR(ComponentVisibility[[#This Row],[Force True]],AND(ComponentVisibility[[#This Row],[Program True]],NOT(ComponentVisibility[[#This Row],[Force False]])))","v":false},"Vissible row(s) if \"TRUE\"",{"$f":"vmIsJHDPL=\"Yes\"","v":false},null,false]
[null,"HOSN Scoring",{"$f":"ROW('HOSN Scoring'!A17)","v":17},{"$f":"ROW('HOSN Scoring'!A17)","v":17},null,null,{"$f":"OR(ComponentVisibility[[#This Row],[Force True]],AND(ComponentVisibility[[#This Row],[Program True]],NOT(ComponentVisibility[[#This Row],[Force False]])))","v":false},"Vissible row(s) if \"TRUE\"",{"$f":"vmIsJSHTA=\"Yes\"","v":false},null,false]
[null,"HOSN Scoring",{"$f":"ROW('HOSN Scoring'!A18)","v":18},{"$f":"ROW('HOSN Scoring'!A18)","v":18},null,null,{"$f":"OR(ComponentVisibility[[#This Row],[Force True]],AND(ComponentVisibility[[#This Row],[Program True]],NOT(ComponentVisibility[[#This Row],[Force False]])))","v":false},"Vissible row(s) if \"TRUE\"",{"$f":"vmIsJMA=\"Yes\"","v":false},null,false]
[null,"HOSN Scoring",{"$f":"ROW('HOSN Scoring'!A19)","v":19},{"$f":"ROW('HOSN Scoring'!A19)","v":19},null,null,{"$f":"OR(ComponentVisibility[[#This Row],[Force True]],AND(ComponentVisibility[[#This Row],[Program True]],NOT(ComponentVisibility[[#This Row],[Force False]])))","v":false},"Vissible row(s) if \"TRUE\"",{"$f":"vmIsJOOR=\"Yes\"","v":false},null,false]
[null,"HOSN Scoring",{"$f":"ROW('HOSN Scoring'!A20)","v":20},{"$f":"ROW('HOSN Scoring'!A20)","v":20},null,null,{"$f":"OR(ComponentVisibility[[#This Row],[Force True]],AND(ComponentVisibility[[#This Row],[Program True]],NOT(ComponentVisibility[[#This Row],[Force False]])))","v":false},"Vissible row(s) if \"TRUE\"",{"$f":"vmIsJAMH=\"Yes\"","v":false},null,false]
[null,"HOSN Scoring",{"$f":"ROW('HOSN Scoring'!A22)","v":22},{"$f":"ROW('HOSN Scoring'!A31)","v":31},null,null,{"$f":"OR(ComponentVisibility[[#This Row],[Force True]],AND(ComponentVisibility[[#This Row],[Program True]],NOT(ComponentVisibility[[#This Row],[Force False]])))","v":false},"Vissible row(s) if \"TRUE\"",{"$f":"vmIsCalhome=\"Yes\"","v":false},null,false]
[null,"HOSN Scoring",{"$f":"ROW('HOSN Scoring'!A25)","v":25},{"$f":"ROW('HOSN Scoring'!A25)","v":25},null,null,{"$f":"OR(ComponentVisibility[[#This Row],[Force True]],AND(ComponentVisibility[[#This Row],[Program True]],NOT(ComponentVisibility[[#This Row],[Force False]])))","v":false},"Vissible row(s) if \"TRUE\"",{"$f":"vmIsHDPL=\"Yes\"","v":false},null,false]
[null,"HOSN Scoring",{"$f":"ROW('HOSN Scoring'!A26)","v":26},{"$f":"ROW('HOSN Scoring'!A26)","v":26},null,null,{"$f":"OR(ComponentVisibility[[#This Row],[Force True]],AND(ComponentVisibility[[#This Row],[Program True]],NOT(ComponentVisibility[[#This Row],[Force False]])))","v":false},"Vissible row(s) if \"TRUE\"",{"$f":"vmIsSHTA=\"Yes\"","v":false},null,false]
[null,"HOSN Scoring",{"$f":"ROW('HOSN Scoring'!A27)","v":27},{"$f":"ROW('HOSN Scoring'!A27)","v":27},null,null,{"$f":"OR(ComponentVisibility[[#This Row],[Force True]],AND(ComponentVisibility[[#This Row],[Program True]],NOT(ComponentVisibility[[#This Row],[Force False]])))","v":false},"Vissible row(s) if \"TRUE\"",{"$f":"vmIsMA=\"Yes\"","v":false},null,false]
[null,"HOSN Scoring",{"$f":"ROW('HOSN Scoring'!A28)","v":28},{"$f":"ROW('HOSN Scoring'!A28)","v":28},null,null,{"$f":"OR(ComponentVisibility[[#This Row],[Force True]],AND(ComponentVisibility[[#This Row],[Program True]],NOT(ComponentVisibility[[#This Row],[Force False]])))","v":false},"Vissible row(s) if \"TRUE\"",{"$f":"vmIsOOR=\"Yes\"","v":false},null,false]
[null,"HOSN Scoring",{"$f":"ROW('HOSN Scoring'!A29)","v":29},{"$f":"ROW('HOSN Scoring'!A29)","v":29},null,null,{"$f":"OR(ComponentVisibility[[#This Row],[Force True]],AND(ComponentVisibility[[#This Row],[Program True]],NOT(ComponentVisibility[[#This Row],[Force False]])))","v":false},"Vissible row(s) if \"TRUE\"",{"$f":"vmIsSH=\"Yes\"","v":false},null,false]
[null,"HOSN Scoring",{"$f":"ROW('HOSN Scoring'!A30)","v":30},{"$f":"ROW('HOSN Scoring'!A30)","v":30},null,null,{"$f":"OR(ComponentVisibility[[#This Row],[Force True]],AND(ComponentVisibility[[#This Row],[Program True]],NOT(ComponentVisibility[[#This Row],[Force False]])))","v":false},"Vissible row(s) if \"TRUE\"",{"$f":"vmIsJADU=\"Yes\"","v":false},null,false]
[null,"HOSN Scoring",{"$f":"ROW('HOSN Scoring'!A39)","v":39},{"$f":"ROW('HOSN Scoring'!A39)","v":39},null,null,{"$f":"OR(ComponentVisibility[[#This Row],[Force True]],AND(ComponentVisibility[[#This Row],[Program True]],NOT(ComponentVisibility[[#This Row],[Force False]])))","v":false},"Vissible row(s) if \"TRUE\"",{"$f":"IF(OR(AND(IsCalhome,IsHDPL),AND(IsJSerna,IsJHDPL)),TRUE,FALSE)","v":false},null,false]
[null,"HOSN Scoring",{"$f":"ROW('HOSN Scoring'!A40)","v":40},{"$f":"ROW('HOSN Scoring'!A40)","v":40},null,null,{"$f":"OR(ComponentVisibility[[#This Row],[Force True]],AND(ComponentVisibility[[#This Row],[Program True]],NOT(ComponentVisibility[[#This Row],[Force False]])))","v":false},"Vissible row(s) if \"TRUE\"",{"$f":"IF(OR(AND(IsCalhome,IsSHTA),AND(IsJSerna,IsJSHTA)),TRUE,FALSE)","v":false},null,false]
[null,"HOSN Scoring",{"$f":"ROW('HOSN Scoring'!A41)","v":41},{"$f":"ROW('HOSN Scoring'!A41)","v":41},null,null,{"$f":"OR(ComponentVisibility[[#This Row],[Force True]],AND(ComponentVisibility[[#This Row],[Program True]],NOT(ComponentVisibility[[#This Row],[Force False]])))","v":false},"Vissible row(s) if \"TRUE\"",{"$f":"IF(OR(AND(IsCalhome,IsMA),AND(IsJSerna,IsJMA)),TRUE,FALSE)","v":false},null,false]
[null,"HOSN Scoring",{"$f":"ROW('HOSN Scoring'!A42)","v":42},{"$f":"ROW('HOSN Scoring'!A42)","v":42},null,null,{"$f":"OR(ComponentVisibility[[#This Row],[Force True]],AND(ComponentVisibility[[#This Row],[Program True]],NOT(ComponentVisibility[[#This Row],[Force False]])))","v":false},"Vissible row(s) if \"TRUE\"",{"$f":"IF(OR(AND(IsCalhome,IsOOR),AND(IsJSerna,IsJOOR)),TRUE,FALSE)","v":false},null,false]
[null,"HOSN Scoring",{"$f":"ROW('HOSN Scoring'!A43)","v":43},{"$f":"ROW('HOSN Scoring'!A43)","v":43},null,null,{"$f":"OR(ComponentVisibility[[#This Row],[Force True]],AND(ComponentVisibility[[#This Row],[Program True]],NOT(ComponentVisibility[[#This Row],[Force False]])))","v":false},"Vissible row(s) if \"TRUE\"",{"$f":"IF(AND(IsCalhome,IsSH),TRUE,FALSE)","v":false},null,false]
[null,"HOSN Scoring",{"$f":"ROW('HOSN Scoring'!A44)","v":44},{"$f":"ROW('HOSN Scoring'!A44)","v":44},null,null,{"$f":"OR(ComponentVisibility[[#This Row],[Force True]],AND(ComponentVisibility[[#This Row],[Program True]],NOT(ComponentVisibility[[#This Row],[Force False]])))","v":false},"Vissible row(s) if \"TRUE\"",{"$f":"IF(AND(IsCalhome,IsJADU),TRUE,FALSE)","v":false},null,false]
[null,"HOSN Scoring",{"$f":"ROW('HOSN Scoring'!A45)","v":45},{"$f":"ROW('HOSN Scoring'!A45)","v":45},null,null,{"$f":"OR(ComponentVisibility[[#This Row],[Force True]],AND(ComponentVisibility[[#This Row],[Program True]],NOT(ComponentVisibility[[#This Row],[Force False]])))","v":false},"Vissible row(s) if \"TRUE\"",{"$f":"IF(AND(IsJSerna,IsJAMH),TRUE,FALSE)","v":false},null,false]
[null,"HOSN Scoring",{"$f":"ROW('HOSN Scoring'!A52)","v":52},{"$f":"ROW('HOSN Scoring'!A52)","v":52},null,null,{"$f":"OR(ComponentVisibility[[#This Row],[Force True]],AND(ComponentVisibility[[#This Row],[Program True]],NOT(ComponentVisibility[[#This Row],[Force False]])))","v":false},"Vissible row(s) if \"TRUE\"",{"$f":"IF(OR(AND(IsCalhome,IsHDPL),AND(IsJSerna,IsJHDPL)),TRUE,FALSE)","v":false},null,false]
[null,"HOSN Scoring",{"$f":"ROW('HOSN Scoring'!A53)","v":53},{"$f":"ROW('HOSN Scoring'!A53)","v":53},null,null,{"$f":"OR(ComponentVisibility[[#This Row],[Force True]],AND(ComponentVisibility[[#This Row],[Program True]],NOT(ComponentVisibility[[#This Row],[Force False]])))","v":false},"Vissible row(s) if \"TRUE\"",{"$f":"IF(OR(AND(IsCalhome,IsSHTA),AND(IsJSerna,IsJSHTA)),TRUE,FALSE)","v":false},null,false]
[null,"HOSN Scoring",{"$f":"ROW('HOSN Scoring'!A54)","v":54},{"$f":"ROW('HOSN Scoring'!A54)","v":54},null,null,{"$f":"OR(ComponentVisibility[[#This Row],[Force True]],AND(ComponentVisibility[[#This Row],[Program True]],NOT(ComponentVisibility[[#This Row],[Force False]])))","v":false},"Vissible row(s) if \"TRUE\"",{"$f":"IF(OR(AND(IsCalhome,IsMA),AND(IsJSerna,IsJMA)),TRUE,FALSE)","v":false},null,false]
[null,"HOSN Scoring",{"$f":"ROW('HOSN Scoring'!A55)","v":55},{"$f":"ROW('HOSN Scoring'!A55)","v":55},null,null,{"$f":"OR(ComponentVisibility[[#This Row],[Force True]],AND(ComponentVisibility[[#This Row],[Program True]],NOT(ComponentVisibility[[#This Row],[Force False]])))","v":false},"Vissible row(s) if \"TRUE\"",{"$f":"IF(OR(AND(IsCalhome,IsOOR),AND(IsJSerna,IsJOOR)),TRUE,FALSE)","v":false},null,false]
[null,"HOSN Scoring",{"$f":"ROW('HOSN Scoring'!A56)","v":56},{"$f":"ROW('HOSN Scoring'!A56)","v":56},null,null,{"$f":"OR(ComponentVisibility[[#This Row],[Force True]],AND(ComponentVisibility[[#This Row],[Program True]],NOT(ComponentVisibility[[#This Row],[Force False]])))","v":false},"Vissible row(s) if \"TRUE\"",{"$f":"IF(AND(IsCalhome,IsSH),TRUE,FALSE)","v":false},null,false]
[null,"HOSN Scoring",{"$f":"ROW('HOSN Scoring'!A57)","v":57},{"$f":"ROW('HOSN Scoring'!A57)","v":57},null,null,{"$f":"OR(ComponentVisibility[[#This Row],[Force True]],AND(ComponentVisibility[[#This Row],[Program True]],NOT(ComponentVisibility[[#This Row],[Force False]])))","v":false},"Vissible row(s) if \"TRUE\"",{"$f":"IF(AND(IsCalhome,IsJADU),TRUE,FALSE)","v":false},null,false]
[null,"HOSN Scoring",{"$f":"ROW('HOSN Scoring'!A58)","v":58},{"$f":"ROW('HOSN Scoring'!A58)","v":58},null,null,{"$f":"OR(ComponentVisibility[[#This Row],[Force True]],AND(ComponentVisibility[[#This Row],[Program True]],NOT(ComponentVisibility[[#This Row],[Force False]])))","v":false},"Vissible row(s) if \"TRUE\"",{"$f":"IF(AND(IsJSerna,IsJAMH),TRUE,FALSE)","v":false},null,false]
[null,"HOSN Scoring",{"$f":"ROW('HOSN Scoring'!A62)","v":62},{"$f":"ROW('HOSN Scoring'!A62)","v":62},null,null,{"$f":"OR(ComponentVisibility[[#This Row],[Force True]],AND(ComponentVisibility[[#This Row],[Program True]],NOT(ComponentVisibility[[#This Row],[Force False]])))","v":false},"Vissible row(s) if \"TRUE\"",{"$f":"AND(IsCalhome,IsMA)","v":false},null,false]
[null,"HOSN Scoring",{"$f":"ROW('HOSN Scoring'!A63)","v":63},{"$f":"ROW('HOSN Scoring'!A64)","v":64},null,null,{"$f":"OR(ComponentVisibility[[#This Row],[Force True]],AND(ComponentVisibility[[#This Row],[Program True]],NOT(ComponentVisibility[[#This Row],[Force False]])))","v":false},"Vissible row(s) if \"TRUE\"",{"$f":"AND(IsCalhome,IsMA,vmHNA1=\"Yes\")","v":false},null,false]
[null,"HOSN Scoring",{"$f":"ROW('HOSN Scoring'!A65)","v":65},{"$f":"ROW('HOSN Scoring'!A65)","v":65},null,null,{"$f":"OR(ComponentVisibility[[#This Row],[Force True]],AND(ComponentVisibility[[#This Row],[Program True]],NOT(ComponentVisibility[[#This Row],[Force False]])))","v":false},"Vissible row(s) if \"TRUE\"",{"$f":"AND(IsJSerna,IsJMA)","v":false},null,false]
[null,"HOSN Scoring",{"$f":"ROW('HOSN Scoring'!A66)","v":66},{"$f":"ROW('HOSN Scoring'!A67)","v":67},null,null,{"$f":"OR(ComponentVisibility[[#This Row],[Force True]],AND(ComponentVisibility[[#This Row],[Program True]],NOT(ComponentVisibility[[#This Row],[Force False]])))","v":false},"Vissible row(s) if \"TRUE\"",{"$f":"AND(IsJSerna,IsJMA,vmHNA2=\"Yes\")","v":false},null,false]
[null,"HOSN Scoring",{"$f":"ROW('HOSN Scoring'!A70)","v":70},{"$f":"ROW('HOSN Scoring'!A70)","v":70},null,null,{"$f":"OR(ComponentVisibility[[#This Row],[Force True]],AND(ComponentVisibility[[#This Row],[Program True]],NOT(ComponentVisibility[[#This Row],[Force False]])))","v":false},"Vissible row(s) if \"TRUE\"",{"$f":"IF(OR(AND(IsCalhome,IsHDPL),AND(IsJSerna,IsJHDPL)),TRUE,FALSE)","v":false},null,false]
[null,"HOSN Scoring",{"$f":"ROW('HOSN Scoring'!A71)","v":71},{"$f":"ROW('HOSN Scoring'!A71)","v":71},null,null,{"$f":"OR(ComponentVisibility[[#This Row],[Force True]],AND(ComponentVisibility[[#This Row],[Program True]],NOT(ComponentVisibility[[#This Row],[Force False]])))","v":false},"Vissible row(s) if \"TRUE\"",{"$f":"IF(OR(AND(IsCalhome,IsSHTA),AND(IsJSerna,IsJSHTA)),TRUE,FALSE)","v":false},null,false]
[null,"HOSN Scoring",{"$f":"ROW('HOSN Scoring'!A72)","v":72},{"$f":"ROW('HOSN Scoring'!A72)","v":72},null,null,{"$f":"OR(ComponentVisibility[[#This Row],[Force True]],AND(ComponentVisibility[[#This Row],[Program True]],NOT(ComponentVisibility[[#This Row],[Force False]])))","v":false},"Vissible row(s) if \"TRUE\"",{"$f":"IF(OR(AND(IsCalhome,IsMA),AND(IsJSerna,IsJMA)),TRUE,FALSE)","v":false},null,false]
[null,"HOSN Scoring",{"$f":"ROW('HOSN Scoring'!A73)","v":73},{"$f":"ROW('HOSN Scoring'!A73)","v":73},null,null,{"$f":"OR(ComponentVisibility[[#This Row],[Force True]],AND(ComponentVisibility[[#This Row],[Program True]],NOT(ComponentVisibility[[#This Row],[Force False]])))","v":false},"Vissible row(s) if \"TRUE\"",{"$f":"IF(OR(AND(IsCalhome,IsOOR),AND(IsJSerna,IsJOOR)),TRUE,FALSE)","v":false},null,false]
[null,"HOSN Scoring",{"$f":"ROW('HOSN Scoring'!A74)","v":74},{"$f":"ROW('HOSN Scoring'!A74)","v":74},null,null,{"$f":"OR(ComponentVisibility[[#This Row],[Force True]],AND(ComponentVisibility[[#This Row],[Program True]],NOT(ComponentVisibility[[#This Row],[Force False]])))","v":false},"Vissible row(s) if \"TRUE\"",{"$f":"IF(AND(IsCalhome,IsSH),TRUE,FALSE)","v":false},null,false]
[null,"HOSN Scoring",{"$f":"ROW('HOSN Scoring'!A75)","v":75},{"$f":"ROW('HOSN Scoring'!A75)","v":75},null,null,{"$f":"OR(ComponentVisibility[[#This Row],[Force True]],AND(ComponentVisibility[[#This Row],[Program True]],NOT(ComponentVisibility[[#This Row],[Force False]])))","v":false},"Vissible row(s) if \"TRUE\"",{"$f":"IF(AND(IsCalhome,IsJADU),TRUE,FALSE)","v":false},null,false]
[null,"HOSN Scoring",{"$f":"ROW('HOSN Scoring'!A76)","v":76},{"$f":"ROW('HOSN Scoring'!A76)","v":76},null,null,{"$f":"OR(ComponentVisibility[[#This Row],[Force True]],AND(ComponentVisibility[[#This Row],[Program True]],NOT(ComponentVisibility[[#This Row],[Force False]])))","v":false},"Vissible row(s) if \"TRUE\"",{"$f":"IF(AND(IsJSerna,IsJAMH),TRUE,FALSE)","v":false},null,false]
[null,"HOSN Scoring",{"$f":"ROW('HOSN Scoring'!A81)","v":81},{"$f":"ROW('HOSN Scoring'!A81)","v":81},null,null,{"$f":"OR(ComponentVisibility[[#This Row],[Force True]],AND(ComponentVisibility[[#This Row],[Program True]],NOT(ComponentVisibility[[#This Row],[Force False]])))","v":false},"Vissible row(s) if \"TRUE\"",{"$f":"AND(IsCalhome,IsHDPL)","v":false},null,false]
[null,"HOSN Scoring",{"$f":"ROW('HOSN Scoring'!A82)","v":82},{"$f":"ROW('HOSN Scoring'!A85)","v":85},null,null,{"$f":"OR(ComponentVisibility[[#This Row],[Force True]],AND(ComponentVisibility[[#This Row],[Program True]],NOT(ComponentVisibility[[#This Row],[Force False]])))","v":false},"Vissible row(s) if \"TRUE\"",{"$f":"vmCommunityR=\"Yes\"","v":false},null,false]
[null,"HOSN Scoring",{"$f":"ROW('HOSN Scoring'!A86)","v":86},{"$f":"ROW('HOSN Scoring'!A87)","v":87},null,null,{"$f":"OR(ComponentVisibility[[#This Row],[Force True]],AND(ComponentVisibility[[#This Row],[Program True]],NOT(ComponentVisibility[[#This Row],[Force False]])))","v":false},"Vissible row(s) if \"TRUE\"",{"$f":"OR(vmDesignatedArea=\"Federal Promise Zone\",vmDesignatedAreaA=\"Federal Promise Zone\",vmDesignatedAreaB=\"Federal Promise Zone\",vmDesignatedAreaC=\"Federal Promise Zone\")","v":false},null,false]
[null,"HOSN Scoring",{"$f":"ROW('HOSN Scoring'!A88)","v":88},{"$f":"ROW('HOSN Scoring'!A88)","v":88},null,null,{"$f":"OR(ComponentVisibility[[#This Row],[Force True]],AND(ComponentVisibility[[#This Row],[Program True]],NOT(ComponentVisibility[[#This Row],[Force False]])))","v":false},"Vissible row(s) if \"TRUE\"",{"$f":"OR(vmDesignatedArea=\"Choice Neighborhood Initiative Area\",vmDesignatedAreaA=\"Choice Neighborhood Initiative Area\",vmDesignatedAreaB=\"Choice Neighborhood Initiative Area\",vmDesignatedAreaC=\"Choice Neighborhood Initiative Area\")","v":false},null,false]
[null,"HOSN Scoring",{"$f":"ROW('HOSN Scoring'!A89)","v":89},{"$f":"ROW('HOSN Scoring'!A90)","v":90},null,null,{"$f":"OR(ComponentVisibility[[#This Row],[Force True]],AND(ComponentVisibility[[#This Row],[Program True]],NOT(ComponentVisibility[[#This Row],[Force False]])))","v":false},"Vissible row(s) if \"TRUE\"",{"$f":"OR(vmDesignatedArea=\"Opportunity Zone\",vmDesignatedAreaA=\"Opportunity Zone\",vmDesignatedAreaB=\"Opportunity Zone\",vmDesignatedAreaC=\"Opportunity Zone\")","v":false},null,false]
[null,"HOSN Scoring",{"$f":"ROW('HOSN Scoring'!A91)","v":91},{"$f":"ROW('HOSN Scoring'!A92)","v":92},null,null,{"$f":"OR(ComponentVisibility[[#This Row],[Force True]],AND(ComponentVisibility[[#This Row],[Program True]],NOT(ComponentVisibility[[#This Row],[Force False]])))","v":false},"Vissible row(s) if \"TRUE\"",{"$f":"OR(vmDesignatedArea=\"Federally designated Justice40 Initiative disadvantaged community\",vmDesignatedAreaA=\"Federally designated Justice40 Initiative disadvantaged community\",vmDesignatedAreaB=\"Federally designated Justice40 Initiative disadvantaged community\",vmDesignatedAreaC=\"Federally designated Justice40 Initiative disadvantaged community\")","v":false},null,false]
[null,"HOSN Scoring",{"$f":"ROW('HOSN Scoring'!A93)","v":93},{"$f":"ROW('HOSN Scoring'!A93)","v":93},null,null,{"$f":"OR(ComponentVisibility[[#This Row],[Force True]],AND(ComponentVisibility[[#This Row],[Program True]],NOT(ComponentVisibility[[#This Row],[Force False]])))","v":false},"Vissible row(s) if \"TRUE\"",{"$f":"AND(IsCalhome,IsHDPL)","v":false},null,false]
[null,"HOSN Scoring",{"$f":"ROW('HOSN Scoring'!A94)","v":94},{"$f":"ROW('HOSN Scoring'!A96)","v":96},null,null,{"$f":"OR(ComponentVisibility[[#This Row],[Force True]],AND(ComponentVisibility[[#This Row],[Program True]],NOT(ComponentVisibility[[#This Row],[Force False]])))","v":false},"Vissible row(s) if \"TRUE\"",{"$f":"vmCalHHResource=\"Yes\"","v":false},null,false]
[null,"HOSN Scoring",{"$f":"ROW('HOSN Scoring'!A98)","v":98},{"$f":"ROW('HOSN Scoring'!A98)","v":98},null,null,{"$f":"OR(ComponentVisibility[[#This Row],[Force True]],AND(ComponentVisibility[[#This Row],[Program True]],NOT(ComponentVisibility[[#This Row],[Force False]])))","v":false},"Vissible row(s) if \"TRUE\"",{"$f":"AND(IsSerna,IsJHDPL)","v":false},null,false]
[null,"HOSN Scoring",{"$f":"ROW('HOSN Scoring'!A99)","v":99},{"$f":"ROW('HOSN Scoring'!A102)","v":102},null,null,{"$f":"OR(ComponentVisibility[[#This Row],[Force True]],AND(ComponentVisibility[[#This Row],[Program True]],NOT(ComponentVisibility[[#This Row],[Force False]])))","v":false},"Vissible row(s) if \"TRUE\"",{"$f":"vmCommunityR2=\"Yes\"","v":false},null,false]
[null,"HOSN Scoring",{"$f":"ROW('HOSN Scoring'!A103)","v":103},{"$f":"ROW('HOSN Scoring'!A104)","v":104},null,null,{"$f":"OR(ComponentVisibility[[#This Row],[Force True]],AND(ComponentVisibility[[#This Row],[Program True]],NOT(ComponentVisibility[[#This Row],[Force False]])))","v":false},"Vissible row(s) if \"TRUE\"",{"$f":"OR(vmDesignatedArea2=\"Federal Promise Zone\",vmDesignatedArea2A=\"Federal Promise Zone\",vmDesignatedArea2B=\"Federal Promise Zone\",vmDesignatedArea2C=\"Federal Promise Zone\")","v":false},null,false]
[null,"HOSN Scoring",{"$f":"ROW('HOSN Scoring'!A105)","v":105},{"$f":"ROW('HOSN Scoring'!A105)","v":105},null,null,{"$f":"OR(ComponentVisibility[[#This Row],[Force True]],AND(ComponentVisibility[[#This Row],[Program True]],NOT(ComponentVisibility[[#This Row],[Force False]])))","v":false},"Vissible row(s) if \"TRUE\"",{"$f":"OR(vmDesignatedArea2=\"Choice Neighborhood Initiative Area\",vmDesignatedArea2A=\"Choice Neighborhood Initiative Area\",vmDesignatedArea2B=\"Choice Neighborhood Initiative Area\",vmDesignatedArea2C=\"Choice Neighborhood Initiative Area\")","v":false},null,false]
[null,"HOSN Scoring",{"$f":"ROW('HOSN Scoring'!A106)","v":106},{"$f":"ROW('HOSN Scoring'!A107)","v":107},null,null,{"$f":"OR(ComponentVisibility[[#This Row],[Force True]],AND(ComponentVisibility[[#This Row],[Program True]],NOT(ComponentVisibility[[#This Row],[Force False]])))","v":false},"Vissible row(s) if \"TRUE\"",{"$f":"OR(vmDesignatedArea2=\"Opportunity Zone\",vmDesignatedArea2A=\"Opportunity Zone\",vmDesignatedArea2B=\"Opportunity Zone\",vmDesignatedArea2C=\"Opportunity Zone\")","v":false},null,false]
[null,"HOSN Scoring",{"$f":"ROW('HOSN Scoring'!A108)","v":108},{"$f":"ROW('HOSN Scoring'!A109)","v":109},null,null,{"$f":"OR(ComponentVisibility[[#This Row],[Force True]],AND(ComponentVisibility[[#This Row],[Program True]],NOT(ComponentVisibility[[#This Row],[Force False]])))","v":false},"Vissible row(s) if \"TRUE\"",{"$f":"OR(vmDesignatedArea2=\"Federally designated Justice40 Initiative disadvantaged community\",vmDesignatedArea2A=\"Federally designated Justice40 Initiative disadvantaged community\",vmDesignatedArea2B=\"Federally designated Justice40 Initiative disadvantaged community\",vmDesignatedArea2C=\"Federally designated Justice40 Initiative disadvantaged community\")","v":false},null,false]
[null,"HOSN Scoring",{"$f":"ROW('HOSN Scoring'!A110)","v":110},{"$f":"ROW('HOSN Scoring'!A110)","v":110},null,null,{"$f":"OR(ComponentVisibility[[#This Row],[Force True]],AND(ComponentVisibility[[#This Row],[Program True]],NOT(ComponentVisibility[[#This Row],[Force False]])))","v":false},"Vissible row(s) if \"TRUE\"",{"$f":"AND(IsSerna,IsJHDPL)","v":false},null,false]
[null,"HOSN Scoring",{"$f":"ROW('HOSN Scoring'!A111)","v":111},{"$f":"ROW('HOSN Scoring'!A113)","v":113},null,null,{"$f":"OR(ComponentVisibility[[#This Row],[Force True]],AND(ComponentVisibility[[#This Row],[Program True]],NOT(ComponentVisibility[[#This Row],[Force False]])))","v":false},"Vissible row(s) if \"TRUE\"",{"$f":"vmJHHResource=\"Yes\"","v":false},null,false]
[null,"HOSN Scoring",{"$f":"ROW('HOSN Scoring'!A115)","v":115},{"$f":"ROW('HOSN Scoring'!A115)","v":115},null,null,{"$f":"OR(ComponentVisibility[[#This Row],[Force True]],AND(ComponentVisibility[[#This Row],[Program True]],NOT(ComponentVisibility[[#This Row],[Force False]])))","v":false},"Vissible row(s) if \"TRUE\"",{"$f":"AND(IsCalhome,IsSHTA)","v":false},null,false]
[null,"HOSN Scoring",{"$f":"ROW('HOSN Scoring'!A116)","v":116},{"$f":"ROW('HOSN Scoring'!A119)","v":119},null,null,{"$f":"OR(ComponentVisibility[[#This Row],[Force True]],AND(ComponentVisibility[[#This Row],[Program True]],NOT(ComponentVisibility[[#This Row],[Force False]])))","v":false},"Vissible row(s) if \"TRUE\"",{"$f":"vmCommunityR3=\"Yes\"","v":false},null,false]
[null,"HOSN Scoring",{"$f":"ROW('HOSN Scoring'!A120)","v":120},{"$f":"ROW('HOSN Scoring'!A121)","v":121},null,null,{"$f":"OR(ComponentVisibility[[#This Row],[Force True]],AND(ComponentVisibility[[#This Row],[Program True]],NOT(ComponentVisibility[[#This Row],[Force False]])))","v":false},"Vissible row(s) if \"TRUE\"",{"$f":"OR(vmDesignatedArea3=\"Federal Promise Zone\",vmDesignatedArea3A=\"Federal Promise Zone\",vmDesignatedArea3B=\"Federal Promise Zone\",vmDesignatedArea3C=\"Federal Promise Zone\")","v":false},null,false]
[null,"HOSN Scoring",{"$f":"ROW('HOSN Scoring'!A122)","v":122},{"$f":"ROW('HOSN Scoring'!A122)","v":122},null,null,{"$f":"OR(ComponentVisibility[[#This Row],[Force True]],AND(ComponentVisibility[[#This Row],[Program True]],NOT(ComponentVisibility[[#This Row],[Force False]])))","v":false},"Vissible row(s) if \"TRUE\"",{"$f":"OR(vmDesignatedArea3=\"Choice Neighborhood Initiative Area\",vmDesignatedArea3A=\"Choice Neighborhood Initiative Area\",vmDesignatedArea3B=\"Choice Neighborhood Initiative Area\",vmDesignatedArea3C=\"Choice Neighborhood Initiative Area\")","v":false},null,false]
[null,"HOSN Scoring",{"$f":"ROW('HOSN Scoring'!A123)","v":123},{"$f":"ROW('HOSN Scoring'!A124)","v":124},null,null,{"$f":"OR(ComponentVisibility[[#This Row],[Force True]],AND(ComponentVisibility[[#This Row],[Program True]],NOT(ComponentVisibility[[#This Row],[Force False]])))","v":false},"Vissible row(s) if \"TRUE\"",{"$f":"OR(vmDesignatedArea3=\"Opportunity Zone\",vmDesignatedArea3A=\"Opportunity Zone\",vmDesignatedArea3B=\"Opportunity Zone\",vmDesignatedArea3C=\"Opportunity Zone\")","v":false},null,false]
[null,"HOSN Scoring",{"$f":"ROW('HOSN Scoring'!A125)","v":125},{"$f":"ROW('HOSN Scoring'!A126)","v":126},null,null,{"$f":"OR(ComponentVisibility[[#This Row],[Force True]],AND(ComponentVisibility[[#This Row],[Program True]],NOT(ComponentVisibility[[#This Row],[Force False]])))","v":false},"Vissible row(s) if \"TRUE\"",{"$f":"OR(vmDesignatedArea3=\"Federally designated Justice40 Initiative disadvantaged community\",vmDesignatedArea3A=\"Federally designated Justice40 Initiative disadvantaged community\",vmDesignatedArea3B=\"Federally designated Justice40 Initiative disadvantaged community\",vmDesignatedArea3C=\"Federally designated Justice40 Initiative disadvantaged community\")","v":false},null,false]
[null,"HOSN Scoring",{"$f":"ROW('HOSN Scoring'!A127)","v":127},{"$f":"ROW('HOSN Scoring'!A127)","v":127},null,null,{"$f":"OR(ComponentVisibility[[#This Row],[Force True]],AND(ComponentVisibility[[#This Row],[Program True]],NOT(ComponentVisibility[[#This Row],[Force False]])))","v":false},"Vissible row(s) if \"TRUE\"",{"$f":"AND(IsCalhome,IsSHTA)","v":false},null,false]
[null,"HOSN Scoring",{"$f":"ROW('HOSN Scoring'!A128)","v":128},{"$f":"ROW('HOSN Scoring'!A132)","v":132},null,null,{"$f":"OR(ComponentVisibility[[#This Row],[Force True]],AND(ComponentVisibility[[#This Row],[Program True]],NOT(ComponentVisibility[[#This Row],[Force False]])))","v":false},"Vissible row(s) if \"TRUE\"",{"$f":"vmOAM1=\"Yes\"","v":false},null,false]
[null,"HOSN Scoring",{"$f":"ROW('HOSN Scoring'!A134)","v":134},{"$f":"ROW('HOSN Scoring'!A134)","v":134},null,null,{"$f":"OR(ComponentVisibility[[#This Row],[Force True]],AND(ComponentVisibility[[#This Row],[Program True]],NOT(ComponentVisibility[[#This Row],[Force False]])))","v":false},"Vissible row(s) if \"TRUE\"",{"$f":"AND(IsSerna,IsJSHTA)","v":false},null,false]
[null,"HOSN Scoring",{"$f":"ROW('HOSN Scoring'!A135)","v":135},{"$f":"ROW('HOSN Scoring'!A138)","v":138},null,null,{"$f":"OR(ComponentVisibility[[#This Row],[Force True]],AND(ComponentVisibility[[#This Row],[Program True]],NOT(ComponentVisibility[[#This Row],[Force False]])))","v":false},"Vissible row(s) if \"TRUE\"",{"$f":"vmCommunityR4=\"Yes\"","v":false},null,false]
[null,"HOSN Scoring",{"$f":"ROW('HOSN Scoring'!A139)","v":139},{"$f":"ROW('HOSN Scoring'!A140)","v":140},null,null,{"$f":"OR(ComponentVisibility[[#This Row],[Force True]],AND(ComponentVisibility[[#This Row],[Program True]],NOT(ComponentVisibility[[#This Row],[Force False]])))","v":false},"Vissible row(s) if \"TRUE\"",{"$f":"OR(vmDesignatedArea4=\"Federal Promise Zone\",vmDesignatedArea4A=\"Federal Promise Zone\",vmDesignatedArea4B=\"Federal Promise Zone\",vmDesignatedArea4C=\"Federal Promise Zone\")","v":false},null,false]
[null,"HOSN Scoring",{"$f":"ROW('HOSN Scoring'!A141)","v":141},{"$f":"ROW('HOSN Scoring'!A141)","v":141},null,null,{"$f":"OR(ComponentVisibility[[#This Row],[Force True]],AND(ComponentVisibility[[#This Row],[Program True]],NOT(ComponentVisibility[[#This Row],[Force False]])))","v":false},"Vissible row(s) if \"TRUE\"",{"$f":"OR(vmDesignatedArea4=\"Choice Neighborhood Initiative Area\",vmDesignatedArea4A=\"Choice Neighborhood Initiative Area\",vmDesignatedArea4B=\"Choice Neighborhood Initiative Area\",vmDesignatedArea4C=\"Choice Neighborhood Initiative Area\")","v":false},null,false]
[null,"HOSN Scoring",{"$f":"ROW('HOSN Scoring'!A142)","v":142},{"$f":"ROW('HOSN Scoring'!A143)","v":143},null,null,{"$f":"OR(ComponentVisibility[[#This Row],[Force True]],AND(ComponentVisibility[[#This Row],[Program True]],NOT(ComponentVisibility[[#This Row],[Force False]])))","v":false},"Vissible row(s) if \"TRUE\"",{"$f":"OR(vmDesignatedArea4=\"Opportunity Zone\",vmDesignatedArea4A=\"Opportunity Zone\",vmDesignatedArea4B=\"Opportunity Zone\",vmDesignatedArea4C=\"Opportunity Zone\")","v":false},null,false]
[null,"HOSN Scoring",{"$f":"ROW('HOSN Scoring'!A144)","v":144},{"$f":"ROW('HOSN Scoring'!A145)","v":145},null,null,{"$f":"OR(ComponentVisibility[[#This Row],[Force True]],AND(ComponentVisibility[[#This Row],[Program True]],NOT(ComponentVisibility[[#This Row],[Force False]])))","v":false},"Vissible row(s) if \"TRUE\"",{"$f":"OR(vmDesignatedArea4=\"Federally designated Justice40 Initiative disadvantaged community\",vmDesignatedArea4A=\"Federally designated Justice40 Initiative disadvantaged community\",vmDesignatedArea4B=\"Federally designated Justice40 Initiative disadvantaged community\",vmDesignatedArea4C=\"Federally designated Justice40 Initiative disadvantaged community\")","v":false},null,false]
[null,"HOSN Scoring",{"$f":"ROW('HOSN Scoring'!A146)","v":146},{"$f":"ROW('HOSN Scoring'!A146)","v":146},null,null,{"$f":"OR(ComponentVisibility[[#This Row],[Force True]],AND(ComponentVisibility[[#This Row],[Program True]],NOT(ComponentVisibility[[#This Row],[Force False]])))","v":false},"Vissible row(s) if \"TRUE\"",{"$f":"AND(IsSerna,IsJSHTA)","v":false},null,false]
[null,"HOSN Scoring",{"$f":"ROW('HOSN Scoring'!A147)","v":147},{"$f":"ROW('HOSN Scoring'!A151)","v":151},null,null,{"$f":"OR(ComponentVisibility[[#This Row],[Force True]],AND(ComponentVisibility[[#This Row],[Program True]],NOT(ComponentVisibility[[#This Row],[Force False]])))","v":false},"Vissible row(s) if \"TRUE\"",{"$f":"vmOAM2=\"Yes\"","v":false},null,false]
[null,"HOSN Scoring",{"$f":"ROW('HOSN Scoring'!A153)","v":153},{"$f":"ROW('HOSN Scoring'!A153)","v":153},null,null,{"$f":"OR(ComponentVisibility[[#This Row],[Force True]],AND(ComponentVisibility[[#This Row],[Program True]],NOT(ComponentVisibility[[#This Row],[Force False]])))","v":false},"Vissible row(s) if \"TRUE\"",{"$f":"AND(IsCalhome,IsMA)","v":false},null,false]
[null,"HOSN Scoring",{"$f":"ROW('HOSN Scoring'!A154)","v":154},{"$f":"ROW('HOSN Scoring'!A157)","v":157},null,null,{"$f":"OR(ComponentVisibility[[#This Row],[Force True]],AND(ComponentVisibility[[#This Row],[Program True]],NOT(ComponentVisibility[[#This Row],[Force False]])))","v":false},"Vissible row(s) if \"TRUE\"",{"$f":"vmCommunityR5=\"Yes\"","v":false},null,false]
[null,"HOSN Scoring",{"$f":"ROW('HOSN Scoring'!A158)","v":158},{"$f":"ROW('HOSN Scoring'!A159)","v":159},null,null,{"$f":"OR(ComponentVisibility[[#This Row],[Force True]],AND(ComponentVisibility[[#This Row],[Program True]],NOT(ComponentVisibility[[#This Row],[Force False]])))","v":false},"Vissible row(s) if \"TRUE\"",{"$f":"OR(vmDesignatedArea5=\"Federal Promise Zone\",vmDesignatedArea5A=\"Federal Promise Zone\",vmDesignatedArea5B=\"Federal Promise Zone\",vmDesignatedArea5C=\"Federal Promise Zone\")","v":false},null,false]
[null,"HOSN Scoring",{"$f":"ROW('HOSN Scoring'!A160)","v":160},{"$f":"ROW('HOSN Scoring'!A160)","v":160},null,null,{"$f":"OR(ComponentVisibility[[#This Row],[Force True]],AND(ComponentVisibility[[#This Row],[Program True]],NOT(ComponentVisibility[[#This Row],[Force False]])))","v":false},"Vissible row(s) if \"TRUE\"",{"$f":"OR(vmDesignatedArea5=\"Choice Neighborhood Initiative Area\",vmDesignatedArea5A=\"Choice Neighborhood Initiative Area\",vmDesignatedArea5B=\"Choice Neighborhood Initiative Area\",vmDesignatedArea5C=\"Choice Neighborhood Initiative Area\")","v":false},null,false]
[null,"HOSN Scoring",{"$f":"ROW('HOSN Scoring'!A161)","v":161},{"$f":"ROW('HOSN Scoring'!A162)","v":162},null,null,{"$f":"OR(ComponentVisibility[[#This Row],[Force True]],AND(ComponentVisibility[[#This Row],[Program True]],NOT(ComponentVisibility[[#This Row],[Force False]])))","v":false},"Vissible row(s) if \"TRUE\"",{"$f":"OR(vmDesignatedArea5=\"Opportunity Zone\",vmDesignatedArea5A=\"Opportunity Zone\",vmDesignatedArea5B=\"Opportunity Zone\",vmDesignatedArea5C=\"Opportunity Zone\")","v":false},null,false]
[null,"HOSN Scoring",{"$f":"ROW('HOSN Scoring'!A163)","v":163},{"$f":"ROW('HOSN Scoring'!A164)","v":164},null,null,{"$f":"OR(ComponentVisibility[[#This Row],[Force True]],AND(ComponentVisibility[[#This Row],[Program True]],NOT(ComponentVisibility[[#This Row],[Force False]])))","v":false},"Vissible row(s) if \"TRUE\"",{"$f":"OR(vmDesignatedArea5=\"Federally designated Justice40 Initiative disadvantaged community\",vmDesignatedArea5A=\"Federally designated Justice40 Initiative disadvantaged community\",vmDesignatedArea5B=\"Federally designated Justice40 Initiative disadvantaged community\",vmDesignatedArea5C=\"Federally designated Justice40 Initiative disadvantaged community\")","v":false},null,false]
[null,"HOSN Scoring",{"$f":"ROW('HOSN Scoring'!A165)","v":165},{"$f":"ROW('HOSN Scoring'!A165)","v":165},null,null,{"$f":"OR(ComponentVisibility[[#This Row],[Force True]],AND(ComponentVisibility[[#This Row],[Program True]],NOT(ComponentVisibility[[#This Row],[Force False]])))","v":false},"Vissible row(s) if \"TRUE\"",{"$f":"AND(IsCalhome,IsMA)","v":false},null,false]
[null,"HOSN Scoring",{"$f":"ROW('HOSN Scoring'!A166)","v":166},{"$f":"ROW('HOSN Scoring'!A170)","v":170},null,null,{"$f":"OR(ComponentVisibility[[#This Row],[Force True]],AND(ComponentVisibility[[#This Row],[Program True]],NOT(ComponentVisibility[[#This Row],[Force False]])))","v":false},"Vissible row(s) if \"TRUE\"",{"$f":"vmOAM3=\"Yes\"","v":false},null,false]
[null,"HOSN Scoring",{"$f":"ROW('HOSN Scoring'!A172)","v":172},{"$f":"ROW('HOSN Scoring'!A172)","v":172},null,null,{"$f":"OR(ComponentVisibility[[#This Row],[Force True]],AND(ComponentVisibility[[#This Row],[Program True]],NOT(ComponentVisibility[[#This Row],[Force False]])))","v":false},"Vissible row(s) if \"TRUE\"",{"$f":"AND(IsSerna,IsJMA)","v":false},null,false]
[null,"HOSN Scoring",{"$f":"ROW('HOSN Scoring'!A173)","v":173},{"$f":"ROW('HOSN Scoring'!A176)","v":176},null,null,{"$f":"OR(ComponentVisibility[[#This Row],[Force True]],AND(ComponentVisibility[[#This Row],[Program True]],NOT(ComponentVisibility[[#This Row],[Force False]])))","v":false},"Vissible row(s) if \"TRUE\"",{"$f":"vmCommunityR6=\"Yes\"","v":false},null,false]
[null,"HOSN Scoring",{"$f":"ROW('HOSN Scoring'!A177)","v":177},{"$f":"ROW('HOSN Scoring'!A178)","v":178},null,null,{"$f":"OR(ComponentVisibility[[#This Row],[Force True]],AND(ComponentVisibility[[#This Row],[Program True]],NOT(ComponentVisibility[[#This Row],[Force False]])))","v":false},"Vissible row(s) if \"TRUE\"",{"$f":"OR(vmDesignatedArea6=\"Federal Promise Zone\",vmDesignatedArea6A=\"Federal Promise Zone\",vmDesignatedArea6B=\"Federal Promise Zone\",vmDesignatedArea6C=\"Federal Promise Zone\")","v":false},null,false]
[null,"HOSN Scoring",{"$f":"ROW('HOSN Scoring'!A179)","v":179},{"$f":"ROW('HOSN Scoring'!A179)","v":179},null,null,{"$f":"OR(ComponentVisibility[[#This Row],[Force True]],AND(ComponentVisibility[[#This Row],[Program True]],NOT(ComponentVisibility[[#This Row],[Force False]])))","v":false},"Vissible row(s) if \"TRUE\"",{"$f":"OR(vmDesignatedArea6=\"Choice Neighborhood Initiative Area\",vmDesignatedArea6A=\"Choice Neighborhood Initiative Area\",vmDesignatedArea6B=\"Choice Neighborhood Initiative Area\",vmDesignatedArea6C=\"Choice Neighborhood Initiative Area\")","v":false},null,false]
[null,"HOSN Scoring",{"$f":"ROW('HOSN Scoring'!A180)","v":180},{"$f":"ROW('HOSN Scoring'!A181)","v":181},null,null,{"$f":"OR(ComponentVisibility[[#This Row],[Force True]],AND(ComponentVisibility[[#This Row],[Program True]],NOT(ComponentVisibility[[#This Row],[Force False]])))","v":false},"Vissible row(s) if \"TRUE\"",{"$f":"OR(vmDesignatedArea6=\"Opportunity Zone\",vmDesignatedArea6A=\"Opportunity Zone\",vmDesignatedArea6B=\"Opportunity Zone\",vmDesignatedArea6A=\"Opportunity Zone\")","v":false},null,false]
[null,"HOSN Scoring",{"$f":"ROW('HOSN Scoring'!A182)","v":182},{"$f":"ROW('HOSN Scoring'!A183)","v":183},null,null,{"$f":"OR(ComponentVisibility[[#This Row],[Force True]],AND(ComponentVisibility[[#This Row],[Program True]],NOT(ComponentVisibility[[#This Row],[Force False]])))","v":false},"Vissible row(s) if \"TRUE\"",{"$f":"OR(vmDesignatedArea6=\"Federally designated Justice40 Initiative disadvantaged community\",vmDesignatedArea6A=\"Federally designated Justice40 Initiative disadvantaged community\",vmDesignatedArea6B=\"Federally designated Justice40 Initiative disadvantaged community\",vmDesignatedArea6C=\"Federally designated Justice40 Initiative disadvantaged community\")","v":false},null,false]
[null,"HOSN Scoring",{"$f":"ROW('HOSN Scoring'!A184)","v":184},{"$f":"ROW('HOSN Scoring'!A184)","v":184},null,null,{"$f":"OR(ComponentVisibility[[#This Row],[Force True]],AND(ComponentVisibility[[#This Row],[Program True]],NOT(ComponentVisibility[[#This Row],[Force False]])))","v":false},"Vissible row(s) if \"TRUE\"",{"$f":"AND(IsSerna,IsJMA)","v":false},null,false]
[null,"HOSN Scoring",{"$f":"ROW('HOSN Scoring'!A185)","v":185},{"$f":"ROW('HOSN Scoring'!A189)","v":189},null,null,{"$f":"OR(ComponentVisibility[[#This Row],[Force True]],AND(ComponentVisibility[[#This Row],[Program True]],NOT(ComponentVisibility[[#This Row],[Force False]])))","v":false},"Vissible row(s) if \"TRUE\"",{"$f":"vmOAM4=\"Yes\"","v":false},null,false]
[null,"HOSN Scoring",{"$f":"ROW('HOSN Scoring'!A191)","v":191},{"$f":"ROW('HOSN Scoring'!A191)","v":191},null,null,{"$f":"OR(ComponentVisibility[[#This Row],[Force True]],AND(ComponentVisibility[[#This Row],[Program True]],NOT(ComponentVisibility[[#This Row],[Force False]])))","v":false},"Vissible row(s) if \"TRUE\"",{"$f":"AND(IsCalhome,IsOOR)","v":false},null,false]
[null,"HOSN Scoring",{"$f":"ROW('HOSN Scoring'!A192)","v":192},{"$f":"ROW('HOSN Scoring'!A195)","v":195},null,null,{"$f":"OR(ComponentVisibility[[#This Row],[Force True]],AND(ComponentVisibility[[#This Row],[Program True]],NOT(ComponentVisibility[[#This Row],[Force False]])))","v":false},"Vissible row(s) if \"TRUE\"",{"$f":"vmCommunityR7=\"Yes\"","v":false},null,false]
[null,"HOSN Scoring",{"$f":"ROW('HOSN Scoring'!A196)","v":196},{"$f":"ROW('HOSN Scoring'!A197)","v":197},null,null,{"$f":"OR(ComponentVisibility[[#This Row],[Force True]],AND(ComponentVisibility[[#This Row],[Program True]],NOT(ComponentVisibility[[#This Row],[Force False]])))","v":false},"Vissible row(s) if \"TRUE\"",{"$f":"OR(vmDesignatedArea7=\"Federal Promise Zone\",vmDesignatedArea7A=\"Federal Promise Zone\",vmDesignatedArea7B=\"Federal Promise Zone\",vmDesignatedArea7C=\"Federal Promise Zone\")","v":false},null,false]
[null,"HOSN Scoring",{"$f":"ROW('HOSN Scoring'!A198)","v":198},{"$f":"ROW('HOSN Scoring'!A198)","v":198},null,null,{"$f":"OR(ComponentVisibility[[#This Row],[Force True]],AND(ComponentVisibility[[#This Row],[Program True]],NOT(ComponentVisibility[[#This Row],[Force False]])))","v":false},"Vissible row(s) if \"TRUE\"",{"$f":"OR(vmDesignatedArea7=\"Choice Neighborhood Initiative Area\",vmDesignatedArea7A=\"Choice Neighborhood Initiative Area\",vmDesignatedArea7B=\"Choice Neighborhood Initiative Area\",vmDesignatedArea7C=\"Choice Neighborhood Initiative Area\")","v":false},null,false]
[null,"HOSN Scoring",{"$f":"ROW('HOSN Scoring'!A199)","v":199},{"$f":"ROW('HOSN Scoring'!A200)","v":200},null,null,{"$f":"OR(ComponentVisibility[[#This Row],[Force True]],AND(ComponentVisibility[[#This Row],[Program True]],NOT(ComponentVisibility[[#This Row],[Force False]])))","v":false},"Vissible row(s) if \"TRUE\"",{"$f":"OR(vmDesignatedArea7=\"Opportunity Zone\",vmDesignatedArea7A=\"Opportunity Zone\",vmDesignatedArea7B=\"Opportunity Zone\",vmDesignatedArea7C=\"Opportunity Zone\")","v":false},null,false]
[null,"HOSN Scoring",{"$f":"ROW('HOSN Scoring'!A201)","v":201},{"$f":"ROW('HOSN Scoring'!A202)","v":202},null,null,{"$f":"OR(ComponentVisibility[[#This Row],[Force True]],AND(ComponentVisibility[[#This Row],[Program True]],NOT(ComponentVisibility[[#This Row],[Force False]])))","v":false},"Vissible row(s) if \"TRUE\"",{"$f":"OR(vmDesignatedArea7=\"Federally designated Justice40 Initiative disadvantaged community\",vmDesignatedArea7A=\"Federally designated Justice40 Initiative disadvantaged community\",vmDesignatedArea7B=\"Federally designated Justice40 Initiative disadvantaged community\",vmDesignatedArea7C=\"Federally designated Justice40 Initiative disadvantaged community\")","v":false},null,false]
[null,"HOSN Scoring",{"$f":"ROW('HOSN Scoring'!A203)","v":203},{"$f":"ROW('HOSN Scoring'!A203)","v":203},null,null,{"$f":"OR(ComponentVisibility[[#This Row],[Force True]],AND(ComponentVisibility[[#This Row],[Program True]],NOT(ComponentVisibility[[#This Row],[Force False]])))","v":false},"Vissible row(s) if \"TRUE\"",{"$f":"AND(IsCalhome,IsOOR)","v":false},null,false]
[null,"HOSN Scoring",{"$f":"ROW('HOSN Scoring'!A204)","v":204},{"$f":"ROW('HOSN Scoring'!A208)","v":208},null,null,{"$f":"OR(ComponentVisibility[[#This Row],[Force True]],AND(ComponentVisibility[[#This Row],[Program True]],NOT(ComponentVisibility[[#This Row],[Force False]])))","v":false},"Vissible row(s) if \"TRUE\"",{"$f":"vmOAM5=\"Yes\"","v":false},null,false]
[null,"HOSN Scoring",{"$f":"ROW('HOSN Scoring'!A210)","v":210},{"$f":"ROW('HOSN Scoring'!A210)","v":210},null,null,{"$f":"OR(ComponentVisibility[[#This Row],[Force True]],AND(ComponentVisibility[[#This Row],[Program True]],NOT(ComponentVisibility[[#This Row],[Force False]])))","v":false},"Vissible row(s) if \"TRUE\"",{"$f":"AND(IsSerna,IsJOOR)","v":false},null,false]
[null,"HOSN Scoring",{"$f":"ROW('HOSN Scoring'!A211)","v":211},{"$f":"ROW('HOSN Scoring'!A214)","v":214},null,null,{"$f":"OR(ComponentVisibility[[#This Row],[Force True]],AND(ComponentVisibility[[#This Row],[Program True]],NOT(ComponentVisibility[[#This Row],[Force False]])))","v":false},"Vissible row(s) if \"TRUE\"",{"$f":"vmCommunityR8=\"Yes\"","v":false},null,false]
[null,"HOSN Scoring",{"$f":"ROW('HOSN Scoring'!A215)","v":215},{"$f":"ROW('HOSN Scoring'!A216)","v":216},null,null,{"$f":"OR(ComponentVisibility[[#This Row],[Force True]],AND(ComponentVisibility[[#This Row],[Program True]],NOT(ComponentVisibility[[#This Row],[Force False]])))","v":false},"Vissible row(s) if \"TRUE\"",{"$f":"OR(vmDesignatedArea8=\"Federal Promise Zone\",vmDesignatedArea8A=\"Federal Promise Zone\",vmDesignatedArea8B=\"Federal Promise Zone\",vmDesignatedArea8C=\"Federal Promise Zone\")","v":false},null,false]
[null,"HOSN Scoring",{"$f":"ROW('HOSN Scoring'!A217)","v":217},{"$f":"ROW('HOSN Scoring'!A217)","v":217},null,null,{"$f":"OR(ComponentVisibility[[#This Row],[Force True]],AND(ComponentVisibility[[#This Row],[Program True]],NOT(ComponentVisibility[[#This Row],[Force False]])))","v":false},"Vissible row(s) if \"TRUE\"",{"$f":"OR(vmDesignatedArea8=\"Choice Neighborhood Initiative Area\",vmDesignatedArea8A=\"Choice Neighborhood Initiative Area\",vmDesignatedArea8B=\"Choice Neighborhood Initiative Area\",vmDesignatedArea8C=\"Choice Neighborhood Initiative Area\")","v":false},null,false]
[null,"HOSN Scoring",{"$f":"ROW('HOSN Scoring'!A218)","v":218},{"$f":"ROW('HOSN Scoring'!A219)","v":219},null,null,{"$f":"OR(ComponentVisibility[[#This Row],[Force True]],AND(ComponentVisibility[[#This Row],[Program True]],NOT(ComponentVisibility[[#This Row],[Force False]])))","v":false},"Vissible row(s) if \"TRUE\"",{"$f":"OR(vmDesignatedArea8=\"Opportunity Zone\",vmDesignatedArea8A=\"Opportunity Zone\",vmDesignatedArea8B=\"Opportunity Zone\",vmDesignatedArea8C=\"Opportunity Zone\")","v":false},null,false]
[null,"HOSN Scoring",{"$f":"ROW('HOSN Scoring'!A220)","v":220},{"$f":"ROW('HOSN Scoring'!A221)","v":221},null,null,{"$f":"OR(ComponentVisibility[[#This Row],[Force True]],AND(ComponentVisibility[[#This Row],[Program True]],NOT(ComponentVisibility[[#This Row],[Force False]])))","v":false},"Vissible row(s) if \"TRUE\"",{"$f":"OR(vmDesignatedArea8=\"Federally designated Justice40 Initiative disadvantaged community\",vmDesignatedArea8A=\"Federally designated Justice40 Initiative disadvantaged community\",vmDesignatedArea8B=\"Federally designated Justice40 Initiative disadvantaged community\",vmDesignatedArea8C=\"Federally designated Justice40 Initiative disadvantaged community\")","v":false},null,false]
[null,"HOSN Scoring",{"$f":"ROW('HOSN Scoring'!A222)","v":222},{"$f":"ROW('HOSN Scoring'!A222)","v":222},null,null,{"$f":"OR(ComponentVisibility[[#This Row],[Force True]],AND(ComponentVisibility[[#This Row],[Program True]],NOT(ComponentVisibility[[#This Row],[Force False]])))","v":false},"Vissible row(s) if \"TRUE\"",{"$f":"AND(IsSerna,IsJOOR)","v":false},null,false]
[null,"HOSN Scoring",{"$f":"ROW('HOSN Scoring'!A223)","v":223},{"$f":"ROW('HOSN Scoring'!A227)","v":227},null,null,{"$f":"OR(ComponentVisibility[[#This Row],[Force True]],AND(ComponentVisibility[[#This Row],[Program True]],NOT(ComponentVisibility[[#This Row],[Force False]])))","v":false},"Vissible row(s) if \"TRUE\"",{"$f":"vmOAM6=\"Yes\"","v":false},null,false]
[null,"HOSN Scoring",{"$f":"ROW('HOSN Scoring'!A229)","v":229},{"$f":"ROW('HOSN Scoring'!A229)","v":229},null,null,{"$f":"OR(ComponentVisibility[[#This Row],[Force True]],AND(ComponentVisibility[[#This Row],[Program True]],NOT(ComponentVisibility[[#This Row],[Force False]])))","v":false},"Vissible row(s) if \"TRUE\"",{"$f":"AND(IsCalhome,IsSH)","v":false},null,false]
[null,"HOSN Scoring",{"$f":"ROW('HOSN Scoring'!A230)","v":230},{"$f":"ROW('HOSN Scoring'!A233)","v":233},null,null,{"$f":"OR(ComponentVisibility[[#This Row],[Force True]],AND(ComponentVisibility[[#This Row],[Program True]],NOT(ComponentVisibility[[#This Row],[Force False]])))","v":false},"Vissible row(s) if \"TRUE\"",{"$f":"vmCommunityR9=\"Yes\"","v":false},null,false]
[null,"HOSN Scoring",{"$f":"ROW('HOSN Scoring'!A234)","v":234},{"$f":"ROW('HOSN Scoring'!A235)","v":235},null,null,{"$f":"OR(ComponentVisibility[[#This Row],[Force True]],AND(ComponentVisibility[[#This Row],[Program True]],NOT(ComponentVisibility[[#This Row],[Force False]])))","v":false},"Vissible row(s) if \"TRUE\"",{"$f":"OR(vmDesignatedArea9=\"Federal Promise Zone\",vmDesignatedArea9A=\"Federal Promise Zone\",vmDesignatedArea9B=\"Federal Promise Zone\",vmDesignatedArea9C=\"Federal Promise Zone\")","v":false},null,false]
[null,"HOSN Scoring",{"$f":"ROW('HOSN Scoring'!A236)","v":236},{"$f":"ROW('HOSN Scoring'!A236)","v":236},null,null,{"$f":"OR(ComponentVisibility[[#This Row],[Force True]],AND(ComponentVisibility[[#This Row],[Program True]],NOT(ComponentVisibility[[#This Row],[Force False]])))","v":false},"Vissible row(s) if \"TRUE\"",{"$f":"OR(vmDesignatedArea9=\"Choice Neighborhood Initiative Area\",vmDesignatedArea9A=\"Choice Neighborhood Initiative Area\",vmDesignatedArea9B=\"Choice Neighborhood Initiative Area\",vmDesignatedArea9C=\"Choice Neighborhood Initiative Area\")","v":false},null,false]
[null,"HOSN Scoring",{"$f":"ROW('HOSN Scoring'!A237)","v":237},{"$f":"ROW('HOSN Scoring'!A238)","v":238},null,null,{"$f":"OR(ComponentVisibility[[#This Row],[Force True]],AND(ComponentVisibility[[#This Row],[Program True]],NOT(ComponentVisibility[[#This Row],[Force False]])))","v":false},"Vissible row(s) if \"TRUE\"",{"$f":"OR(vmDesignatedArea9=\"Opportunity Zone\",vmDesignatedArea9A=\"Opportunity Zone\",vmDesignatedArea9B=\"Opportunity Zone\",vmDesignatedArea9C=\"Opportunity Zone\")","v":false},null,false]
[null,"HOSN Scoring",{"$f":"ROW('HOSN Scoring'!A239)","v":239},{"$f":"ROW('HOSN Scoring'!A240)","v":240},null,null,{"$f":"OR(ComponentVisibility[[#This Row],[Force True]],AND(ComponentVisibility[[#This Row],[Program True]],NOT(ComponentVisibility[[#This Row],[Force False]])))","v":false},"Vissible row(s) if \"TRUE\"",{"$f":"OR(vmDesignatedArea9=\"Federally designated Justice40 Initiative disadvantaged community\",vmDesignatedArea9A=\"Federally designated Justice40 Initiative disadvantaged community\",vmDesignatedArea9B=\"Federally designated Justice40 Initiative disadvantaged community\",vmDesignatedArea9C=\"Federally designated Justice40 Initiative disadvantaged community\")","v":false},null,false]
[null,"HOSN Scoring",{"$f":"ROW('HOSN Scoring'!A241)","v":241},{"$f":"ROW('HOSN Scoring'!A241)","v":241},null,null,{"$f":"OR(ComponentVisibility[[#This Row],[Force True]],AND(ComponentVisibility[[#This Row],[Program True]],NOT(ComponentVisibility[[#This Row],[Force False]])))","v":false},"Vissible row(s) if \"TRUE\"",{"$f":"AND(IsCalhome,IsSH)","v":false},null,false]
[null,"HOSN Scoring",{"$f":"ROW('HOSN Scoring'!A242)","v":242},{"$f":"ROW('HOSN Scoring'!A246)","v":246},null,null,{"$f":"OR(ComponentVisibility[[#This Row],[Force True]],AND(ComponentVisibility[[#This Row],[Program True]],NOT(ComponentVisibility[[#This Row],[Force False]])))","v":false},"Vissible row(s) if \"TRUE\"",{"$f":"vmOAM7=\"Yes\"","v":false},null,false]
[null,"HOSN Scoring",{"$f":"ROW('HOSN Scoring'!A248)","v":248},{"$f":"ROW('HOSN Scoring'!A248)","v":248},null,null,{"$f":"OR(ComponentVisibility[[#This Row],[Force True]],AND(ComponentVisibility[[#This Row],[Program True]],NOT(ComponentVisibility[[#This Row],[Force False]])))","v":false},"Vissible row(s) if \"TRUE\"",{"$f":"AND(IsCalhome,IsJADU)","v":false},null,false]
[null,"HOSN Scoring",{"$f":"ROW('HOSN Scoring'!A249)","v":249},{"$f":"ROW('HOSN Scoring'!A252)","v":252},null,null,{"$f":"OR(ComponentVisibility[[#This Row],[Force True]],AND(ComponentVisibility[[#This Row],[Program True]],NOT(ComponentVisibility[[#This Row],[Force False]])))","v":false},"Vissible row(s) if \"TRUE\"",{"$f":"vmCommunityR10=\"Yes\"","v":false},null,false]
[null,"HOSN Scoring",{"$f":"ROW('HOSN Scoring'!A253)","v":253},{"$f":"ROW('HOSN Scoring'!A254)","v":254},null,null,{"$f":"OR(ComponentVisibility[[#This Row],[Force True]],AND(ComponentVisibility[[#This Row],[Program True]],NOT(ComponentVisibility[[#This Row],[Force False]])))","v":false},"Vissible row(s) if \"TRUE\"",{"$f":"OR(vmDesignatedArea10=\"Federal Promise Zone\",vmDesignatedArea10A=\"Federal Promise Zone\",vmDesignatedArea10B=\"Federal Promise Zone\",vmDesignatedArea10C=\"Federal Promise Zone\")","v":false},null,false]
[null,"HOSN Scoring",{"$f":"ROW('HOSN Scoring'!A255)","v":255},{"$f":"ROW('HOSN Scoring'!A255)","v":255},null,null,{"$f":"OR(ComponentVisibility[[#This Row],[Force True]],AND(ComponentVisibility[[#This Row],[Program True]],NOT(ComponentVisibility[[#This Row],[Force False]])))","v":false},"Vissible row(s) if \"TRUE\"",{"$f":"OR(vmDesignatedArea10=\"Choice Neighborhood Initiative Area\",vmDesignatedArea10A=\"Choice Neighborhood Initiative Area\",vmDesignatedArea10B=\"Choice Neighborhood Initiative Area\",vmDesignatedArea10C=\"Choice Neighborhood Initiative Area\")","v":false},null,false]
[null,"HOSN Scoring",{"$f":"ROW('HOSN Scoring'!A256)","v":256},{"$f":"ROW('HOSN Scoring'!A257)","v":257},null,null,{"$f":"OR(ComponentVisibility[[#This Row],[Force True]],AND(ComponentVisibility[[#This Row],[Program True]],NOT(ComponentVisibility[[#This Row],[Force False]])))","v":false},"Vissible row(s) if \"TRUE\"",{"$f":"OR(vmDesignatedArea10=\"Opportunity Zone\",vmDesignatedArea10A=\"Opportunity Zone\",vmDesignatedArea10B=\"Opportunity Zone\",vmDesignatedArea10C=\"Opportunity Zone\")","v":false},null,false]
[null,"HOSN Scoring",{"$f":"ROW('HOSN Scoring'!A258)","v":258},{"$f":"ROW('HOSN Scoring'!A259)","v":259},null,null,{"$f":"OR(ComponentVisibility[[#This Row],[Force True]],AND(ComponentVisibility[[#This Row],[Program True]],NOT(ComponentVisibility[[#This Row],[Force False]])))","v":false},"Vissible row(s) if \"TRUE\"",{"$f":"OR(vmDesignatedArea10=\"Federally designated Justice40 Initiative disadvantaged community\",vmDesignatedArea10A=\"Federally designated Justice40 Initiative disadvantaged community\",vmDesignatedArea10B=\"Federally designated Justice40 Initiative disadvantaged community\",vmDesignatedArea10C=\"Federally designated Justice40 Initiative disadvantaged community\")","v":false},null,false]
[null,"HOSN Scoring",{"$f":"ROW('HOSN Scoring'!A260)","v":260},{"$f":"ROW('HOSN Scoring'!A260)","v":260},null,null,{"$f":"OR(ComponentVisibility[[#This Row],[Force True]],AND(ComponentVisibility[[#This Row],[Program True]],NOT(ComponentVisibility[[#This Row],[Force False]])))","v":false},"Vissible row(s) if \"TRUE\"",{"$f":"AND(IsCalhome,IsJADU)","v":false},null,false]
[null,"HOSN Scoring",{"$f":"ROW('HOSN Scoring'!A261)","v":261},{"$f":"ROW('HOSN Scoring'!A265)","v":265},null,null,{"$f":"OR(ComponentVisibility[[#This Row],[Force True]],AND(ComponentVisibility[[#This Row],[Program True]],NOT(ComponentVisibility[[#This Row],[Force False]])))","v":false},"Vissible row(s) if \"TRUE\"",{"$f":"vmOAM8=\"Yes\"","v":false},null,false]
[null,"HOSN Scoring",{"$f":"ROW('HOSN Scoring'!A267)","v":267},{"$f":"ROW('HOSN Scoring'!A267)","v":267},null,null,{"$f":"OR(ComponentVisibility[[#This Row],[Force True]],AND(ComponentVisibility[[#This Row],[Program True]],NOT(ComponentVisibility[[#This Row],[Force False]])))","v":false},"Vissible row(s) if \"TRUE\"",{"$f":"AND(IsSerna,IsJAMH)","v":false},null,false]
[null,"HOSN Scoring",{"$f":"ROW('HOSN Scoring'!A268)","v":268},{"$f":"ROW('HOSN Scoring'!A271)","v":271},null,null,{"$f":"OR(ComponentVisibility[[#This Row],[Force True]],AND(ComponentVisibility[[#This Row],[Program True]],NOT(ComponentVisibility[[#This Row],[Force False]])))","v":false},"Vissible row(s) if \"TRUE\"",{"$f":"vmCommunityR11=\"Yes\"","v":false},null,false]
[null,"HOSN Scoring",{"$f":"ROW('HOSN Scoring'!A272)","v":272},{"$f":"ROW('HOSN Scoring'!A273)","v":273},null,null,{"$f":"OR(ComponentVisibility[[#This Row],[Force True]],AND(ComponentVisibility[[#This Row],[Program True]],NOT(ComponentVisibility[[#This Row],[Force False]])))","v":false},"Vissible row(s) if \"TRUE\"",{"$f":"OR(vmDesignatedArea11=\"Federal Promise Zone\",vmDesignatedArea11A=\"Federal Promise Zone\",vmDesignatedArea11B=\"Federal Promise Zone\",vmDesignatedArea11C=\"Federal Promise Zone\")","v":false},null,false]
[null,"HOSN Scoring",{"$f":"ROW('HOSN Scoring'!A274)","v":274},{"$f":"ROW('HOSN Scoring'!A274)","v":274},null,null,{"$f":"OR(ComponentVisibility[[#This Row],[Force True]],AND(ComponentVisibility[[#This Row],[Program True]],NOT(ComponentVisibility[[#This Row],[Force False]])))","v":false},"Vissible row(s) if \"TRUE\"",{"$f":"OR(vmDesignatedArea11=\"Choice Neighborhood Initiative Area\",vmDesignatedArea11A=\"Choice Neighborhood Initiative Area\",vmDesignatedArea11B=\"Choice Neighborhood Initiative Area\",vmDesignatedArea11C=\"Choice Neighborhood Initiative Area\")","v":false},null,false]
[null,"HOSN Scoring",{"$f":"ROW('HOSN Scoring'!A275)","v":275},{"$f":"ROW('HOSN Scoring'!A276)","v":276},null,null,{"$f":"OR(ComponentVisibility[[#This Row],[Force True]],AND(ComponentVisibility[[#This Row],[Program True]],NOT(ComponentVisibility[[#This Row],[Force False]])))","v":false},"Vissible row(s) if \"TRUE\"",{"$f":"OR(vmDesignatedArea11=\"Opportunity Zone\",vmDesignatedArea11A=\"Opportunity Zone\",vmDesignatedArea11B=\"Opportunity Zone\",vmDesignatedArea11C=\"Opportunity Zone\")","v":false},null,false]
[null,"HOSN Scoring",{"$f":"ROW('HOSN Scoring'!A277)","v":277},{"$f":"ROW('HOSN Scoring'!A278)","v":278},null,null,{"$f":"OR(ComponentVisibility[[#This Row],[Force True]],AND(ComponentVisibility[[#This Row],[Program True]],NOT(ComponentVisibility[[#This Row],[Force False]])))","v":false},"Vissible row(s) if \"TRUE\"",{"$f":"OR(vmDesignatedArea11=\"Federally designated Justice40 Initiative disadvantaged community\",vmDesignatedArea11A=\"Federally designated Justice40 Initiative disadvantaged community\",vmDesignatedArea11B=\"Federally designated Justice40 Initiative disadvantaged community\",vmDesignatedArea11C=\"Federally designated Justice40 Initiative disadvantaged community\")","v":false},null,false]
[null,"HOSN Scoring",{"$f":"ROW('HOSN Scoring'!A279)","v":279},{"$f":"ROW('HOSN Scoring'!A279)","v":279},null,null,{"$f":"OR(ComponentVisibility[[#This Row],[Force True]],AND(ComponentVisibility[[#This Row],[Program True]],NOT(ComponentVisibility[[#This Row],[Force False]])))","v":false},"Vissible row(s) if \"TRUE\"",{"$f":"AND(IsSerna,IsJAMH)","v":false},null,false]
[null,"HOSN Scoring",{"$f":"ROW('HOSN Scoring'!A280)","v":280},{"$f":"ROW('HOSN Scoring'!A284)","v":284},null,null,{"$f":"OR(ComponentVisibility[[#This Row],[Force True]],AND(ComponentVisibility[[#This Row],[Program True]],NOT(ComponentVisibility[[#This Row],[Force False]])))","v":false},"Vissible row(s) if \"TRUE\"",{"$f":"vmOAM9=\"Yes\"","v":false},null,false]
[null,"HOSN Scoring",{"$f":"ROW('HOSN Scoring'!A289)","v":289},{"$f":"ROW('HOSN Scoring'!A289)","v":289},null,null,{"$f":"OR(ComponentVisibility[[#This Row],[Force True]],AND(ComponentVisibility[[#This Row],[Program True]],NOT(ComponentVisibility[[#This Row],[Force False]])))","v":false},"Vissible row(s) if \"TRUE\"",{"$f":"IF(OR(AND(IsCalhome,IsHDPL),AND(IsJSerna,IsJHDPL)),TRUE,FALSE)","v":false},null,false]
[null,"HOSN Scoring",{"$f":"ROW('HOSN Scoring'!A290)","v":290},{"$f":"ROW('HOSN Scoring'!A290)","v":290},null,null,{"$f":"OR(ComponentVisibility[[#This Row],[Force True]],AND(ComponentVisibility[[#This Row],[Program True]],NOT(ComponentVisibility[[#This Row],[Force False]])))","v":false},"Vissible row(s) if \"TRUE\"",{"$f":"IF(OR(AND(IsCalhome,IsSHTA),AND(IsJSerna,IsJSHTA)),TRUE,FALSE)","v":false},null,false]
[null,"HOSN Scoring",{"$f":"ROW('HOSN Scoring'!A291)","v":291},{"$f":"ROW('HOSN Scoring'!A291)","v":291},null,null,{"$f":"OR(ComponentVisibility[[#This Row],[Force True]],AND(ComponentVisibility[[#This Row],[Program True]],NOT(ComponentVisibility[[#This Row],[Force False]])))","v":false},"Vissible row(s) if \"TRUE\"",{"$f":"IF(OR(AND(IsCalhome,IsMA),AND(IsJSerna,IsJMA)),TRUE,FALSE)","v":false},null,false]
[null,"HOSN Scoring",{"$f":"ROW('HOSN Scoring'!A292)","v":292},{"$f":"ROW('HOSN Scoring'!A292)","v":292},null,null,{"$f":"OR(ComponentVisibility[[#This Row],[Force True]],AND(ComponentVisibility[[#This Row],[Program True]],NOT(ComponentVisibility[[#This Row],[Force False]])))","v":false},"Vissible row(s) if \"TRUE\"",{"$f":"IF(OR(AND(IsCalhome,IsOOR),AND(IsJSerna,IsJOOR)),TRUE,FALSE)","v":false},null,false]
[null,"HOSN Scoring",{"$f":"ROW('HOSN Scoring'!A293)","v":293},{"$f":"ROW('HOSN Scoring'!A293)","v":293},null,null,{"$f":"OR(ComponentVisibility[[#This Row],[Force True]],AND(ComponentVisibility[[#This Row],[Program True]],NOT(ComponentVisibility[[#This Row],[Force False]])))","v":false},"Vissible row(s) if \"TRUE\"",{"$f":"IF(AND(IsCalhome,IsSH),TRUE,FALSE)","v":false},null,false]
[null,"HOSN Scoring",{"$f":"ROW('HOSN Scoring'!A294)","v":294},{"$f":"ROW('HOSN Scoring'!A294)","v":294},null,null,{"$f":"OR(ComponentVisibility[[#This Row],[Force True]],AND(ComponentVisibility[[#This Row],[Program True]],NOT(ComponentVisibility[[#This Row],[Force False]])))","v":false},"Vissible row(s) if \"TRUE\"",{"$f":"IF(AND(IsCalhome,IsJADU),TRUE,FALSE)","v":false},null,false]
[null,"HOSN Scoring",{"$f":"ROW('HOSN Scoring'!A295)","v":295},{"$f":"ROW('HOSN Scoring'!A295)","v":295},null,null,{"$f":"OR(ComponentVisibility[[#This Row],[Force True]],AND(ComponentVisibility[[#This Row],[Program True]],NOT(ComponentVisibility[[#This Row],[Force False]])))","v":false},"Vissible row(s) if \"TRUE\"",{"$f":"IF(AND(IsJSerna,IsJAMH),TRUE,FALSE)","v":false},null,false]
[null,"HOSN Scoring",{"$f":"ROW('HOSN Scoring'!A299)","v":299},{"$f":"ROW('HOSN Scoring'!A299)","v":299},null,null,{"$f":"OR(ComponentVisibility[[#This Row],[Force True]],AND(ComponentVisibility[[#This Row],[Program True]],NOT(ComponentVisibility[[#This Row],[Force False]])))","v":false},"Vissible row(s) if \"TRUE\"",{"$f":"AND(IsCalhome,IsMA)","v":false},null,false]
[null,"HOSN Scoring",{"$f":"ROW('HOSN Scoring'!A300)","v":300},{"$f":"ROW('HOSN Scoring'!A300)","v":300},null,null,{"$f":"OR(ComponentVisibility[[#This Row],[Force True]],AND(ComponentVisibility[[#This Row],[Program True]],NOT(ComponentVisibility[[#This Row],[Force False]])))","v":false},"Vissible row(s) if \"TRUE\"",{"$f":"AND(IsJSerna,IsJMA)","v":false},null,false]
[null,"HOSN Scoring",{"$f":"ROW('HOSN Scoring'!A301)","v":301},{"$f":"ROW('HOSN Scoring'!A303)","v":303},null,null,{"$f":"OR(ComponentVisibility[[#This Row],[Force True]],AND(ComponentVisibility[[#This Row],[Program True]],NOT(ComponentVisibility[[#This Row],[Force False]])))","v":false},"Vissible row(s) if \"TRUE\"",{"$f":"AND(IsCalhome,IsMA)","v":false},null,false]
[null,"HOSN Scoring",{"$f":"ROW('HOSN Scoring'!A304)","v":304},{"$f":"ROW('HOSN Scoring'!A306)","v":306},null,null,{"$f":"OR(ComponentVisibility[[#This Row],[Force True]],AND(ComponentVisibility[[#This Row],[Program True]],NOT(ComponentVisibility[[#This Row],[Force False]])))","v":false},"Vissible row(s) if \"TRUE\"",{"$f":"AND(IsJSerna,IsJMA)","v":false},null,false]
[null,"HOSN Scoring",{"$f":"ROW('HOSN Scoring'!A307)","v":307},{"$f":"ROW('HOSN Scoring'!A309)","v":309},null,null,{"$f":"OR(ComponentVisibility[[#This Row],[Force True]],AND(ComponentVisibility[[#This Row],[Program True]],NOT(ComponentVisibility[[#This Row],[Force False]])))","v":false},"Vissible row(s) if \"TRUE\"",{"$f":"AND(IsCalhome,IsSHTA)","v":false},null,false]
[null,"HOSN Scoring",{"$f":"ROW('HOSN Scoring'!A310)","v":310},{"$f":"ROW('HOSN Scoring'!A312)","v":312},null,null,{"$f":"OR(ComponentVisibility[[#This Row],[Force True]],AND(ComponentVisibility[[#This Row],[Program True]],NOT(ComponentVisibility[[#This Row],[Force False]])))","v":false},"Vissible row(s) if \"TRUE\"",{"$f":"AND(IsJSerna,IsJSHTA)","v":false},null,false]
[null,"HOSN Scoring",{"$f":"ROW('HOSN Scoring'!A313)","v":313},{"$f":"ROW('HOSN Scoring'!A315)","v":315},null,null,{"$f":"OR(ComponentVisibility[[#This Row],[Force True]],AND(ComponentVisibility[[#This Row],[Program True]],NOT(ComponentVisibility[[#This Row],[Force False]])))","v":false},"Vissible row(s) if \"TRUE\"",{"$f":"AND(IsCalhome,IsHDPL)","v":false},null,false]
[null,"HOSN Scoring",{"$f":"ROW('HOSN Scoring'!A316)","v":316},{"$f":"ROW('HOSN Scoring'!A318)","v":318},null,null,{"$f":"OR(ComponentVisibility[[#This Row],[Force True]],AND(ComponentVisibility[[#This Row],[Program True]],NOT(ComponentVisibility[[#This Row],[Force False]])))","v":false},"Vissible row(s) if \"TRUE\"",{"$f":"AND(IsJSerna,IsJHDPL)","v":false},null,false]
[null,"HOSN Scoring",{"$f":"ROW('HOSN Scoring'!A322)","v":322},{"$f":"ROW('HOSN Scoring'!A322)","v":322},null,null,{"$f":"OR(ComponentVisibility[[#This Row],[Force True]],AND(ComponentVisibility[[#This Row],[Program True]],NOT(ComponentVisibility[[#This Row],[Force False]])))","v":false},"Vissible row(s) if \"TRUE\"",{"$f":"IF(OR(AND(IsCalhome,IsHDPL),AND(IsJSerna,IsJHDPL)),TRUE,FALSE)","v":false},null,false]
[null,"HOSN Scoring",{"$f":"ROW('HOSN Scoring'!A323)","v":323},{"$f":"ROW('HOSN Scoring'!A323)","v":323},null,null,{"$f":"OR(ComponentVisibility[[#This Row],[Force True]],AND(ComponentVisibility[[#This Row],[Program True]],NOT(ComponentVisibility[[#This Row],[Force False]])))","v":false},"Vissible row(s) if \"TRUE\"",{"$f":"IF(OR(AND(IsCalhome,IsSHTA),AND(IsJSerna,IsJSHTA)),TRUE,FALSE)","v":false},null,false]
[null,"HOSN Scoring",{"$f":"ROW('HOSN Scoring'!A324)","v":324},{"$f":"ROW('HOSN Scoring'!A324)","v":324},null,null,{"$f":"OR(ComponentVisibility[[#This Row],[Force True]],AND(ComponentVisibility[[#This Row],[Program True]],NOT(ComponentVisibility[[#This Row],[Force False]])))","v":false},"Vissible row(s) if \"TRUE\"",{"$f":"IF(OR(AND(IsCalhome,IsMA),AND(IsJSerna,IsJMA)),TRUE,FALSE)","v":false},null,false]
[null,"HOSN Scoring",{"$f":"ROW('HOSN Scoring'!A328)","v":328},{"$f":"ROW('HOSN Scoring'!A330)","v":330},null,null,{"$f":"OR(ComponentVisibility[[#This Row],[Force True]],AND(ComponentVisibility[[#This Row],[Program True]],NOT(ComponentVisibility[[#This Row],[Force False]])))","v":false},"Vissible row(s) if \"TRUE\"",{"$f":"AND(IsCalhome,IsMA)","v":false},null,false]
[null,"HOSN Scoring",{"$f":"ROW('HOSN Scoring'!A330)","v":330},{"$f":"ROW('HOSN Scoring'!A330)","v":330},null,null,{"$f":"OR(ComponentVisibility[[#This Row],[Force True]],AND(ComponentVisibility[[#This Row],[Program True]],NOT(ComponentVisibility[[#This Row],[Force False]])))","v":false},"Vissible row(s) if \"TRUE\"",{"$f":"vmInfillSite=\"Yes\"","v":false},null,false]
[null,"HOSN Scoring",{"$f":"ROW('HOSN Scoring'!A331)","v":331},{"$f":"ROW('HOSN Scoring'!A333)","v":333},null,null,{"$f":"OR(ComponentVisibility[[#This Row],[Force True]],AND(ComponentVisibility[[#This Row],[Program True]],NOT(ComponentVisibility[[#This Row],[Force False]])))","v":false},"Vissible row(s) if \"TRUE\"",{"$f":"AND(IsJSerna,IsJMA)","v":false},null,false]
[null,"HOSN Scoring",{"$f":"ROW('HOSN Scoring'!A333)","v":333},{"$f":"ROW('HOSN Scoring'!A333)","v":333},null,null,{"$f":"OR(ComponentVisibility[[#This Row],[Force True]],AND(ComponentVisibility[[#This Row],[Program True]],NOT(ComponentVisibility[[#This Row],[Force False]])))","v":false},"Vissible row(s) if \"TRUE\"",{"$f":"vmInfillSite2=\"Yes\"","v":false},null,false]
[null,"HOSN Scoring",{"$f":"ROW('HOSN Scoring'!A334)","v":334},{"$f":"ROW('HOSN Scoring'!A334)","v":334},null,null,{"$f":"OR(ComponentVisibility[[#This Row],[Force True]],AND(ComponentVisibility[[#This Row],[Program True]],NOT(ComponentVisibility[[#This Row],[Force False]])))","v":false},"Vissible row(s) if \"TRUE\"",{"$f":"AND(IsCalhome,IsHDPL)","v":false},null,false]
[null,"HOSN Scoring",{"$f":"ROW('HOSN Scoring'!A335)","v":335},{"$f":"ROW('HOSN Scoring'!A335)","v":335},null,null,{"$f":"OR(ComponentVisibility[[#This Row],[Force True]],AND(ComponentVisibility[[#This Row],[Program True]],NOT(ComponentVisibility[[#This Row],[Force False]])))","v":false},"Vissible row(s) if \"TRUE\"",{"$f":"vmInfillSite3=\"Yes\"","v":false},null,false]
[null,"HOSN Scoring",{"$f":"ROW('HOSN Scoring'!A336)","v":336},{"$f":"ROW('HOSN Scoring'!A336)","v":336},null,null,{"$f":"OR(ComponentVisibility[[#This Row],[Force True]],AND(ComponentVisibility[[#This Row],[Program True]],NOT(ComponentVisibility[[#This Row],[Force False]])))","v":false},"Vissible row(s) if \"TRUE\"",{"$f":"AND(IsJSerna,IsJHDPL)","v":false},null,false]
[null,"HOSN Scoring",{"$f":"ROW('HOSN Scoring'!A337)","v":337},{"$f":"ROW('HOSN Scoring'!A337)","v":337},null,null,{"$f":"OR(ComponentVisibility[[#This Row],[Force True]],AND(ComponentVisibility[[#This Row],[Program True]],NOT(ComponentVisibility[[#This Row],[Force False]])))","v":false},"Vissible row(s) if \"TRUE\"",{"$f":"vmInfillSite4=\"Yes\"","v":false},null,false]
[null,"HOSN Scoring",{"$f":"ROW('HOSN Scoring'!A338)","v":338},{"$f":"ROW('HOSN Scoring'!A338)","v":338},null,null,{"$f":"OR(ComponentVisibility[[#This Row],[Force True]],AND(ComponentVisibility[[#This Row],[Program True]],NOT(ComponentVisibility[[#This Row],[Force False]])))","v":false},"Vissible row(s) if \"TRUE\"",{"$f":"AND(IsCalhome,IsSHTA)","v":false},null,false]
[null,"HOSN Scoring",{"$f":"ROW('HOSN Scoring'!A339)","v":339},{"$f":"ROW('HOSN Scoring'!A339)","v":339},null,null,{"$f":"OR(ComponentVisibility[[#This Row],[Force True]],AND(ComponentVisibility[[#This Row],[Program True]],NOT(ComponentVisibility[[#This Row],[Force False]])))","v":false},"Vissible row(s) if \"TRUE\"",{"$f":"vmInfillSite5=\"Yes\"","v":false},null,false]
[null,"HOSN Scoring",{"$f":"ROW('HOSN Scoring'!A340)","v":340},{"$f":"ROW('HOSN Scoring'!A340)","v":340},null,null,{"$f":"OR(ComponentVisibility[[#This Row],[Force True]],AND(ComponentVisibility[[#This Row],[Program True]],NOT(ComponentVisibility[[#This Row],[Force False]])))","v":false},"Vissible row(s) if \"TRUE\"",{"$f":"AND(IsJSerna,IsJSHTA)","v":false},null,false]
[null,"HOSN Scoring",{"$f":"ROW('HOSN Scoring'!A341)","v":341},{"$f":"ROW('HOSN Scoring'!A341)","v":341},null,null,{"$f":"OR(ComponentVisibility[[#This Row],[Force True]],AND(ComponentVisibility[[#This Row],[Program True]],NOT(ComponentVisibility[[#This Row],[Force False]])))","v":false},"Vissible row(s) if \"TRUE\"",{"$f":"vmInfillSite6=\"Yes\"","v":false},null,false]
[null,"HOSN Scoring",{"$f":"ROW('HOSN Scoring'!A342)","v":342},{"$f":"ROW('HOSN Scoring'!A342)","v":342},null,null,{"$f":"OR(ComponentVisibility[[#This Row],[Force True]],AND(ComponentVisibility[[#This Row],[Program True]],NOT(ComponentVisibility[[#This Row],[Force False]])))","v":false},"Vissible row(s) if \"TRUE\"",{"$f":"AND(IsCalhome,IsJADU)","v":false},null,false]
[null,"HOSN Scoring",{"$f":"ROW('HOSN Scoring'!A343)","v":343},{"$f":"ROW('HOSN Scoring'!A343)","v":343},null,null,{"$f":"OR(ComponentVisibility[[#This Row],[Force True]],AND(ComponentVisibility[[#This Row],[Program True]],NOT(ComponentVisibility[[#This Row],[Force False]])))","v":false},"Vissible row(s) if \"TRUE\"",{"$f":"vmInfillSite7=\"Yes\"","v":false},null,false]
[null,"HOSN Scoring",{"$f":"ROW('HOSN Scoring'!A344)","v":344},{"$f":"ROW('HOSN Scoring'!A344)","v":344},null,null,{"$f":"OR(ComponentVisibility[[#This Row],[Force True]],AND(ComponentVisibility[[#This Row],[Program True]],NOT(ComponentVisibility[[#This Row],[Force False]])))","v":false},"Vissible row(s) if \"TRUE\"",{"$f":"AND(IsJSerna,IsJAMH)","v":false},null,false]
[null,"HOSN Scoring",{"$f":"ROW('HOSN Scoring'!A345)","v":345},{"$f":"ROW('HOSN Scoring'!A345)","v":345},null,null,{"$f":"OR(ComponentVisibility[[#This Row],[Force True]],AND(ComponentVisibility[[#This Row],[Program True]],NOT(ComponentVisibility[[#This Row],[Force False]])))","v":false},"Vissible row(s) if \"TRUE\"",{"$f":"vmInfillSite8=\"Yes\"","v":false},null,false]
[null,"HOSN Scoring",{"$f":"ROW('HOSN Scoring'!A349)","v":349},{"$f":"ROW('HOSN Scoring'!A349)","v":349},null,null,{"$f":"OR(ComponentVisibility[[#This Row],[Force True]],AND(ComponentVisibility[[#This Row],[Program True]],NOT(ComponentVisibility[[#This Row],[Force False]])))","v":false},"Vissible row(s) if \"TRUE\"",{"$f":"IF(OR(AND(IsCalhome,IsHDPL),AND(IsJSerna,IsJHDPL)),TRUE,FALSE)","v":false},null,false]
[null,"HOSN Scoring",{"$f":"ROW('HOSN Scoring'!A350)","v":350},{"$f":"ROW('HOSN Scoring'!A350)","v":350},null,null,{"$f":"OR(ComponentVisibility[[#This Row],[Force True]],AND(ComponentVisibility[[#This Row],[Program True]],NOT(ComponentVisibility[[#This Row],[Force False]])))","v":false},"Vissible row(s) if \"TRUE\"",{"$f":"IF(OR(AND(IsCalhome,IsSHTA),AND(IsJSerna,IsJSHTA)),TRUE,FALSE)","v":false},null,false]
[null,"HOSN Scoring",{"$f":"ROW('HOSN Scoring'!A351)","v":351},{"$f":"ROW('HOSN Scoring'!A351)","v":351},null,null,{"$f":"OR(ComponentVisibility[[#This Row],[Force True]],AND(ComponentVisibility[[#This Row],[Program True]],NOT(ComponentVisibility[[#This Row],[Force False]])))","v":false},"Vissible row(s) if \"TRUE\"",{"$f":"IF(OR(AND(IsCalhome,IsMA),AND(IsJSerna,IsJMA)),TRUE,FALSE)","v":false},null,false]
[null,"HOSN Scoring",{"$f":"ROW('HOSN Scoring'!A352)","v":352},{"$f":"ROW('HOSN Scoring'!A352)","v":352},null,null,{"$f":"OR(ComponentVisibility[[#This Row],[Force True]],AND(ComponentVisibility[[#This Row],[Program True]],NOT(ComponentVisibility[[#This Row],[Force False]])))","v":false},"Vissible row(s) if \"TRUE\"",{"$f":"IF(AND(IsCalhome,IsJADU),TRUE,FALSE)","v":false},null,false]
[null,"HOSN Scoring",{"$f":"ROW('HOSN Scoring'!A353)","v":353},{"$f":"ROW('HOSN Scoring'!A353)","v":353},null,null,{"$f":"OR(ComponentVisibility[[#This Row],[Force True]],AND(ComponentVisibility[[#This Row],[Program True]],NOT(ComponentVisibility[[#This Row],[Force False]])))","v":false},"Vissible row(s) if \"TRUE\"",{"$f":"IF(AND(IsJSerna,IsJAMH),TRUE,FALSE)","v":false},null,false]
[null,"HOSN Scoring",{"$f":"ROW('HOSN Scoring'!A357)","v":357},{"$f":"ROW('HOSN Scoring'!A357)","v":357},null,null,{"$f":"OR(ComponentVisibility[[#This Row],[Force True]],AND(ComponentVisibility[[#This Row],[Program True]],NOT(ComponentVisibility[[#This Row],[Force False]])))","v":false},"Vissible row(s) if \"TRUE\"",{"$f":"AND(IsCalhome,IsMA)","v":false},null,false]
[null,"HOSN Scoring",{"$f":"ROW('HOSN Scoring'!A358)","v":358},{"$f":"ROW('HOSN Scoring'!A358)","v":358},null,null,{"$f":"OR(ComponentVisibility[[#This Row],[Force True]],AND(ComponentVisibility[[#This Row],[Program True]],NOT(ComponentVisibility[[#This Row],[Force False]])))","v":false},"Vissible row(s) if \"TRUE\"",{"$f":"AND(IsJSerna,IsJMA)","v":false},null,false]
[null,"HOSN Scoring",{"$f":"ROW('HOSN Scoring'!A361)","v":361},{"$f":"ROW('HOSN Scoring'!A361)","v":361},null,null,{"$f":"OR(ComponentVisibility[[#This Row],[Force True]],AND(ComponentVisibility[[#This Row],[Program True]],NOT(ComponentVisibility[[#This Row],[Force False]])))","v":false},"Vissible row(s) if \"TRUE\"",{"$f":"IF(OR(AND(IsCalhome,IsHDPL),AND(IsJSerna,IsJHDPL)),TRUE,FALSE)","v":false},null,false]
[null,"HOSN Scoring",{"$f":"ROW('HOSN Scoring'!A362)","v":362},{"$f":"ROW('HOSN Scoring'!A362)","v":362},null,null,{"$f":"OR(ComponentVisibility[[#This Row],[Force True]],AND(ComponentVisibility[[#This Row],[Program True]],NOT(ComponentVisibility[[#This Row],[Force False]])))","v":false},"Vissible row(s) if \"TRUE\"",{"$f":"IF(OR(AND(IsCalhome,IsSHTA),AND(IsJSerna,IsJSHTA)),TRUE,FALSE)","v":false},null,false]
[null,"HOSN Scoring",{"$f":"ROW('HOSN Scoring'!A363)","v":363},{"$f":"ROW('HOSN Scoring'!A363)","v":363},null,null,{"$f":"OR(ComponentVisibility[[#This Row],[Force True]],AND(ComponentVisibility[[#This Row],[Program True]],NOT(ComponentVisibility[[#This Row],[Force False]])))","v":false},"Vissible row(s) if \"TRUE\"",{"$f":"IF(OR(AND(IsCalhome,IsMA),AND(IsJSerna,IsJMA)),TRUE,FALSE)","v":false},null,false]
[null,"HOSN Scoring",{"$f":"ROW('HOSN Scoring'!A364)","v":364},{"$f":"ROW('HOSN Scoring'!A364)","v":364},null,null,{"$f":"OR(ComponentVisibility[[#This Row],[Force True]],AND(ComponentVisibility[[#This Row],[Program True]],NOT(ComponentVisibility[[#This Row],[Force False]])))","v":false},"Vissible row(s) if \"TRUE\"",{"$f":"IF(OR(AND(IsCalhome,IsOOR),AND(IsJSerna,IsJOOR)),TRUE,FALSE)","v":false},null,false]
[null,"HOSN Scoring",{"$f":"ROW('HOSN Scoring'!A365)","v":365},{"$f":"ROW('HOSN Scoring'!A365)","v":365},null,null,{"$f":"OR(ComponentVisibility[[#This Row],[Force True]],AND(ComponentVisibility[[#This Row],[Program True]],NOT(ComponentVisibility[[#This Row],[Force False]])))","v":false},"Vissible row(s) if \"TRUE\"",{"$f":"IF(AND(IsCalhome,IsSH),TRUE,FALSE)","v":false},null,false]
[null,"HOSN Scoring",{"$f":"ROW('HOSN Scoring'!A366)","v":366},{"$f":"ROW('HOSN Scoring'!A366)","v":366},null,null,{"$f":"OR(ComponentVisibility[[#This Row],[Force True]],AND(ComponentVisibility[[#This Row],[Program True]],NOT(ComponentVisibility[[#This Row],[Force False]])))","v":false},"Vissible row(s) if \"TRUE\"",{"$f":"IF(AND(IsCalhome,IsJADU),TRUE,FALSE)","v":false},null,false]
[null,"HOSN Scoring",{"$f":"ROW('HOSN Scoring'!A367)","v":367},{"$f":"ROW('HOSN Scoring'!A367)","v":367},null,null,{"$f":"OR(ComponentVisibility[[#This Row],[Force True]],AND(ComponentVisibility[[#This Row],[Program True]],NOT(ComponentVisibility[[#This Row],[Force False]])))","v":false},"Vissible row(s) if \"TRUE\"",{"$f":"IF(AND(IsJSerna,IsJAMH),TRUE,FALSE)","v":false},null,false]
[null,"HOSN Scoring",{"$f":"ROW('HOSN Scoring'!A372)","v":372},{"$f":"ROW('HOSN Scoring'!A372)","v":372},null,null,{"$f":"OR(ComponentVisibility[[#This Row],[Force True]],AND(ComponentVisibility[[#This Row],[Program True]],NOT(ComponentVisibility[[#This Row],[Force False]])))","v":false},"Vissible row(s) if \"TRUE\"",{"$f":"AND(IsCalhome,IsHDPL)","v":false},null,false]
[null,"HOSN Scoring",{"$f":"ROW('HOSN Scoring'!A373)","v":373},{"$f":"ROW('HOSN Scoring'!A373)","v":373},null,null,{"$f":"OR(ComponentVisibility[[#This Row],[Force True]],AND(ComponentVisibility[[#This Row],[Program True]],NOT(ComponentVisibility[[#This Row],[Force False]])))","v":false},"Vissible row(s) if \"TRUE\"",{"$f":"AND(IsJSerna,IsJHDPL)","v":false},null,false]
[null,"HOSN Scoring",{"$f":"ROW('HOSN Scoring'!A374)","v":374},{"$f":"ROW('HOSN Scoring'!A374)","v":374},null,null,{"$f":"OR(ComponentVisibility[[#This Row],[Force True]],AND(ComponentVisibility[[#This Row],[Program True]],NOT(ComponentVisibility[[#This Row],[Force False]])))","v":false},"Vissible row(s) if \"TRUE\"",{"$f":"AND(IsCalhome,IsSHTA)","v":false},null,false]
[null,"HOSN Scoring",{"$f":"ROW('HOSN Scoring'!A375)","v":375},{"$f":"ROW('HOSN Scoring'!A375)","v":375},null,null,{"$f":"OR(ComponentVisibility[[#This Row],[Force True]],AND(ComponentVisibility[[#This Row],[Program True]],NOT(ComponentVisibility[[#This Row],[Force False]])))","v":false},"Vissible row(s) if \"TRUE\"",{"$f":"AND(IsJSerna,IsJSHTA)","v":false},null,false]
[null,"HOSN Scoring",{"$f":"ROW('HOSN Scoring'!A376)","v":376},{"$f":"ROW('HOSN Scoring'!A376)","v":376},null,null,{"$f":"OR(ComponentVisibility[[#This Row],[Force True]],AND(ComponentVisibility[[#This Row],[Program True]],NOT(ComponentVisibility[[#This Row],[Force False]])))","v":false},"Vissible row(s) if \"TRUE\"",{"$f":"AND(IsCalhome,IsMA)","v":false},null,false]
[null,"HOSN Scoring",{"$f":"ROW('HOSN Scoring'!A377)","v":377},{"$f":"ROW('HOSN Scoring'!A377)","v":377},null,null,{"$f":"OR(ComponentVisibility[[#This Row],[Force True]],AND(ComponentVisibility[[#This Row],[Program True]],NOT(ComponentVisibility[[#This Row],[Force False]])))","v":false},"Vissible row(s) if \"TRUE\"",{"$f":"AND(IsJSerna,IsJMA)","v":false},null,false]
[null,"HOSN Scoring",{"$f":"ROW('HOSN Scoring'!A378)","v":378},{"$f":"ROW('HOSN Scoring'!A378)","v":378},null,null,{"$f":"OR(ComponentVisibility[[#This Row],[Force True]],AND(ComponentVisibility[[#This Row],[Program True]],NOT(ComponentVisibility[[#This Row],[Force False]])))","v":false},"Vissible row(s) if \"TRUE\"",{"$f":"AND(IsCalhome,IsOOR)","v":false},null,false]
[null,"HOSN Scoring",{"$f":"ROW('HOSN Scoring'!A379)","v":379},{"$f":"ROW('HOSN Scoring'!A379)","v":379},null,null,{"$f":"OR(ComponentVisibility[[#This Row],[Force True]],AND(ComponentVisibility[[#This Row],[Program True]],NOT(ComponentVisibility[[#This Row],[Force False]])))","v":false},"Vissible row(s) if \"TRUE\"",{"$f":"AND(IsJSerna,IsJOOR)","v":false},null,false]
[null,"HOSN Scoring",{"$f":"ROW('HOSN Scoring'!A380)","v":380},{"$f":"ROW('HOSN Scoring'!A380)","v":380},null,null,{"$f":"OR(ComponentVisibility[[#This Row],[Force True]],AND(ComponentVisibility[[#This Row],[Program True]],NOT(ComponentVisibility[[#This Row],[Force False]])))","v":false},"Vissible row(s) if \"TRUE\"",{"$f":"AND(IsCalhome,IsSH)","v":false},null,false]
[null,"HOSN Scoring",{"$f":"ROW('HOSN Scoring'!A381)","v":381},{"$f":"ROW('HOSN Scoring'!A381)","v":381},null,null,{"$f":"OR(ComponentVisibility[[#This Row],[Force True]],AND(ComponentVisibility[[#This Row],[Program True]],NOT(ComponentVisibility[[#This Row],[Force False]])))","v":false},"Vissible row(s) if \"TRUE\"",{"$f":"AND(IsCalhome,IsJADU)","v":false},null,false]
[null,"HOSN Scoring",{"$f":"ROW('HOSN Scoring'!A382)","v":382},{"$f":"ROW('HOSN Scoring'!A382)","v":382},null,null,{"$f":"OR(ComponentVisibility[[#This Row],[Force True]],AND(ComponentVisibility[[#This Row],[Program True]],NOT(ComponentVisibility[[#This Row],[Force False]])))","v":false},"Vissible row(s) if \"TRUE\"",{"$f":"AND(IsJSerna,IsJAMH)","v":false},null,false]
[null,"HOSN Scoring",{"$f":"ROW('HOSN Scoring'!A386)","v":386},{"$f":"ROW('HOSN Scoring'!A386)","v":386},null,null,{"$f":"OR(ComponentVisibility[[#This Row],[Force True]],AND(ComponentVisibility[[#This Row],[Program True]],NOT(ComponentVisibility[[#This Row],[Force False]])))","v":false},"Vissible row(s) if \"TRUE\"",{"$f":"IF(OR(AND(IsCalhome,IsHDPL),AND(IsJSerna,IsJHDPL)),TRUE,FALSE)","v":false},null,false]
[null,"HOSN Scoring",{"$f":"ROW('HOSN Scoring'!A387)","v":387},{"$f":"ROW('HOSN Scoring'!A387)","v":387},null,null,{"$f":"OR(ComponentVisibility[[#This Row],[Force True]],AND(ComponentVisibility[[#This Row],[Program True]],NOT(ComponentVisibility[[#This Row],[Force False]])))","v":false},"Vissible row(s) if \"TRUE\"",{"$f":"IF(OR(AND(IsCalhome,IsSHTA),AND(IsJSerna,IsJSHTA)),TRUE,FALSE)","v":false},null,false]
[null,"HOSN Scoring",{"$f":"ROW('HOSN Scoring'!A388)","v":388},{"$f":"ROW('HOSN Scoring'!A388)","v":388},null,null,{"$f":"OR(ComponentVisibility[[#This Row],[Force True]],AND(ComponentVisibility[[#This Row],[Program True]],NOT(ComponentVisibility[[#This Row],[Force False]])))","v":false},"Vissible row(s) if \"TRUE\"",{"$f":"IF(OR(AND(IsCalhome,IsMA),AND(IsJSerna,IsJMA)),TRUE,FALSE)","v":false},null,false]
[null,"HOSN Scoring",{"$f":"ROW('HOSN Scoring'!A389)","v":389},{"$f":"ROW('HOSN Scoring'!A389)","v":389},null,null,{"$f":"OR(ComponentVisibility[[#This Row],[Force True]],AND(ComponentVisibility[[#This Row],[Program True]],NOT(ComponentVisibility[[#This Row],[Force False]])))","v":false},"Vissible row(s) if \"TRUE\"",{"$f":"IF(OR(AND(IsCalhome,IsOOR),AND(IsJSerna,IsJOOR)),TRUE,FALSE)","v":false},null,false]
[null,"HOSN Scoring",{"$f":"ROW('HOSN Scoring'!A390)","v":390},{"$f":"ROW('HOSN Scoring'!A390)","v":390},null,null,{"$f":"OR(ComponentVisibility[[#This Row],[Force True]],AND(ComponentVisibility[[#This Row],[Program True]],NOT(ComponentVisibility[[#This Row],[Force False]])))","v":false},"Vissible row(s) if \"TRUE\"",{"$f":"IF(AND(IsCalhome,IsSH),TRUE,FALSE)","v":false},null,false]
[null,"HOSN Scoring",{"$f":"ROW('HOSN Scoring'!A391)","v":391},{"$f":"ROW('HOSN Scoring'!A391)","v":391},null,null,{"$f":"OR(ComponentVisibility[[#This Row],[Force True]],AND(ComponentVisibility[[#This Row],[Program True]],NOT(ComponentVisibility[[#This Row],[Force False]])))","v":false},"Vissible row(s) if \"TRUE\"",{"$f":"IF(AND(IsCalhome,IsJADU),TRUE,FALSE)","v":false},null,false]
[null,"HOSN Scoring",{"$f":"ROW('HOSN Scoring'!A392)","v":392},{"$f":"ROW('HOSN Scoring'!A392)","v":392},null,null,{"$f":"OR(ComponentVisibility[[#This Row],[Force True]],AND(ComponentVisibility[[#This Row],[Program True]],NOT(ComponentVisibility[[#This Row],[Force False]])))","v":false},"Vissible row(s) if \"TRUE\"",{"$f":"IF(AND(IsJSerna,IsJAMH),TRUE,FALSE)","v":false},null,false]
[null,"HOSN Scoring",{"$f":"ROW('HOSN Scoring'!A395)","v":395},{"$f":"ROW('HOSN Scoring'!A396)","v":396},null,null,{"$f":"OR(ComponentVisibility[[#This Row],[Force True]],AND(ComponentVisibility[[#This Row],[Program True]],NOT(ComponentVisibility[[#This Row],[Force False]])))","v":false},"Vissible row(s) if \"TRUE\"",{"$f":"IsJSerna","v":false},null,false]
[null,"HOSN Scoring",{"$f":"ROW('HOSN Scoring'!A397)","v":397},{"$f":"ROW('HOSN Scoring'!A397)","v":397},null,null,{"$f":"OR(ComponentVisibility[[#This Row],[Force True]],AND(ComponentVisibility[[#This Row],[Program True]],NOT(ComponentVisibility[[#This Row],[Force False]])))","v":false},"Vissible row(s) if \"TRUE\"",{"$f":"AND(IsJSerna,IsJHDPL)","v":false},null,false]
[null,"HOSN Scoring",{"$f":"ROW('HOSN Scoring'!A398)","v":398},{"$f":"ROW('HOSN Scoring'!A398)","v":398},null,null,{"$f":"OR(ComponentVisibility[[#This Row],[Force True]],AND(ComponentVisibility[[#This Row],[Program True]],NOT(ComponentVisibility[[#This Row],[Force False]])))","v":false},"Vissible row(s) if \"TRUE\"",{"$f":"AND(IsJSerna,IsJSHTA)","v":false},null,false]
[null,"HOSN Scoring",{"$f":"ROW('HOSN Scoring'!A399)","v":399},{"$f":"ROW('HOSN Scoring'!A399)","v":399},null,null,{"$f":"OR(ComponentVisibility[[#This Row],[Force True]],AND(ComponentVisibility[[#This Row],[Program True]],NOT(ComponentVisibility[[#This Row],[Force False]])))","v":false},"Vissible row(s) if \"TRUE\"",{"$f":"AND(IsJSerna,IsJMA)","v":false},null,false]
[null,"HOSN Scoring",{"$f":"ROW('HOSN Scoring'!A400)","v":400},{"$f":"ROW('HOSN Scoring'!A400)","v":400},null,null,{"$f":"OR(ComponentVisibility[[#This Row],[Force True]],AND(ComponentVisibility[[#This Row],[Program True]],NOT(ComponentVisibility[[#This Row],[Force False]])))","v":false},"Vissible row(s) if \"TRUE\"",{"$f":"AND(IsJSerna,IsJOOR)","v":false},null,false]
[null,"HOSN Scoring",{"$f":"ROW('HOSN Scoring'!A401)","v":401},{"$f":"ROW('HOSN Scoring'!A401)","v":401},null,null,{"$f":"OR(ComponentVisibility[[#This Row],[Force True]],AND(ComponentVisibility[[#This Row],[Program True]],NOT(ComponentVisibility[[#This Row],[Force False]])))","v":false},"Vissible row(s) if \"TRUE\"",{"$f":"AND(IsJSerna,IsJAMH)","v":false},null,false]
[null,"HOSN Scoring",{"$f":"ROW('HOSN Scoring'!A402)","v":402},{"$f":"ROW('HOSN Scoring'!A402)","v":402},null,null,{"$f":"OR(ComponentVisibility[[#This Row],[Force True]],AND(ComponentVisibility[[#This Row],[Program True]],NOT(ComponentVisibility[[#This Row],[Force False]])))","v":false},"Vissible row(s) if \"TRUE\"",{"$f":"IsJSerna","v":false},null,false]
[null,"HOSN Scoring",null,null,{"$f":"COLUMN('HOSN Scoring'!AO341)","v":41},{"$f":"COLUMN('HOSN Scoring'!AQ341)","v":43},{"$f":"OR(ComponentVisibility[[#This Row],[Force True]],AND(ComponentVisibility[[#This Row],[Program True]],NOT(ComponentVisibility[[#This Row],[Force False]])))","v":false},"Vissible row(s) if \"TRUE\"",{"$f":"AND(HOSNScoring=\"Yes\",HOSNScoringR1=\"Yes\")","v":false},null,false]
[null,"HOSN Scoring",null,null,{"$f":"COLUMN('HOSN Scoring'!AR342)","v":44},{"$f":"COLUMN('HOSN Scoring'!AT342)","v":46},{"$f":"OR(ComponentVisibility[[#This Row],[Force True]],AND(ComponentVisibility[[#This Row],[Program True]],NOT(ComponentVisibility[[#This Row],[Force False]])))","v":false},"Vissible row(s) if \"TRUE\"",{"$f":"AND(HOSNScoring=\"Yes\",HOSNScoringR2=\"Yes\")","v":false},null,false]
[null,"HOSN Scoring",null,null,{"$f":"COLUMN('HOSN Scoring'!AU343)","v":47},{"$f":"COLUMN('HOSN Scoring'!AW343)","v":49},{"$f":"OR(ComponentVisibility[[#This Row],[Force True]],AND(ComponentVisibility[[#This Row],[Program True]],NOT(ComponentVisibility[[#This Row],[Force False]])))","v":false},"Vissible row(s) if \"TRUE\"",{"$f":"AND(HOSNScoring=\"Yes\",HOSNScoringM=\"Yes\")","v":false},null,false]
[null,"HOSN Scoring",null,null,null,null,{"$f":"OR(ComponentVisibility[[#This Row],[Force True]],AND(ComponentVisibility[[#This Row],[Program True]],NOT(ComponentVisibility[[#This Row],[Force False]])))","v":false},"Vissible Sheet if \"TRUE\"",{"$f":"IF(IsCalhomeTribal,FALSE,OR(IsCalhome,IsJSerna))","v":false},null,false]
[null,"Tribal NOFA Scoring",{"$f":"ROW('Tribal NOFA Scoring'!A32)","v":32},{"$f":"ROW('Tribal NOFA Scoring'!A32)","v":32},null,null,{"$f":"OR(ComponentVisibility[[#This Row],[Force True]],AND(ComponentVisibility[[#This Row],[Program True]],NOT(ComponentVisibility[[#This Row],[Force False]])))","v":true},"Vissible row(s) if \"TRUE\"",{"$f":"vmCRTH=\"contributes to Community Revitalization as defined above\"","v":true},null,false]
[null,"Tribal NOFA Scoring",{"$f":"ROW('Tribal NOFA Scoring'!A33)","v":33},{"$f":"ROW('Tribal NOFA Scoring'!A33)","v":33},null,null,{"$f":"OR(ComponentVisibility[[#This Row],[Force True]],AND(ComponentVisibility[[#This Row],[Program True]],NOT(ComponentVisibility[[#This Row],[Force False]])))","v":false},"Vissible row(s) if \"TRUE\"",{"$f":"vmCRTH=\"will provide a preference for Tribal Households\"","v":false},null,false]
[null,"Tribal NOFA Scoring",{"$f":"ROW('Tribal NOFA Scoring'!A34)","v":34},{"$f":"ROW('Tribal NOFA Scoring'!A34)","v":34},null,null,{"$f":"OR(ComponentVisibility[[#This Row],[Force True]],AND(ComponentVisibility[[#This Row],[Program True]],NOT(ComponentVisibility[[#This Row],[Force False]])))","v":false},"Vissible row(s) if \"TRUE\"",{"$f":"vmCRTH=\"are, or will be, located within Indian Country\"","v":false},null,false]
[null,"Tribal NOFA Scoring",null,null,{"$f":"COLUMN('Tribal NOFA Scoring'!AO348)","v":41},{"$f":"COLUMN('Tribal NOFA Scoring'!AQ348)","v":43},{"$f":"OR(ComponentVisibility[[#This Row],[Force True]],AND(ComponentVisibility[[#This Row],[Program True]],NOT(ComponentVisibility[[#This Row],[Force False]])))","v":false},"Vissible row(s) if \"TRUE\"",{"$f":"AND(TribalScoring=\"Yes\",TribalScoringR1=\"Yes\")","v":false},null,false]
[null,"Tribal NOFA Scoring",null,null,{"$f":"COLUMN('Tribal NOFA Scoring'!AR349)","v":44},{"$f":"COLUMN('Tribal NOFA Scoring'!AT349)","v":46},{"$f":"OR(ComponentVisibility[[#This Row],[Force True]],AND(ComponentVisibility[[#This Row],[Program True]],NOT(ComponentVisibility[[#This Row],[Force False]])))","v":false},"Vissible row(s) if \"TRUE\"",{"$f":"AND(TribalScoring=\"Yes\",TribalScoringR2=\"Yes\")","v":false},null,false]
[null,"Tribal NOFA Scoring",null,null,{"$f":"COLUMN('Tribal NOFA Scoring'!AU350)","v":47},{"$f":"COLUMN('Tribal NOFA Scoring'!AW350)","v":49},{"$f":"OR(ComponentVisibility[[#This Row],[Force True]],AND(ComponentVisibility[[#This Row],[Program True]],NOT(ComponentVisibility[[#This Row],[Force False]])))","v":false},"Vissible row(s) if \"TRUE\"",{"$f":"AND(TribalScoring=\"Yes\",TribalScoringM=\"Yes\")","v":false},null,false]
[null,"Tribal NOFA Scoring",null,null,null,null,{"$f":"OR(ComponentVisibility[[#This Row],[Force True]],AND(ComponentVisibility[[#This Row],[Program True]],NOT(ComponentVisibility[[#This Row],[Force False]])))","v":false},"Vissible Sheet if \"TRUE\"",{"$f":"IsCalhomeTribal","v":false},null,false]

{"sheet":"Dropdowns","index":1,"n_rows":80,"n_cols":11,"rows_kept":80,"cut":false,"hidden":true,"merged":[]}
[1,"SernaEA","CalHomeEA",null,"HRA","NHRA",null,"contributes to Community Revitalization as defined above"]
[2,"Local Public Entity","Local Public Entity",null,"Highest Resource","Moderate Resource (Rapidly Changing)",null,"are, or will be, located within Indian Country",null,"Melendres, Gail","Penner, Kendra"]
[3,"Tribal Entity","Tribal Entity",null,"High Resource","Moderate Resource",null,"will provide a preference for Tribal Households",null,"Allen, Charlptte"]
[4,"Nonprofit Corporation","Nonprofit Corporation",null,null,"Low Resource",null,null,null,"Bouldin, Brandon"]
[5,"Limited Liability Company",null,null,null,"High Segregation & Poverty",null,null,null,"Thomson, Kara"]
[6,"Limited Partnership",null,null,null,"Missing / Insufficient Data",null,null,null,"Brent, Ina"]
[7]
[8]
[9,null,null,null,null,"High Resource"]
[10,"Alameda","Northern",null,"Disposition and Development Agreement","High Segregation & Poverty"]
[11,"Alpine","Rural",null,"Enforceable Option to Lease or Purchase","Highest Resource"]
[12,"Amador","Rural",null,"Exclusive Right to Negotiate","Low Resource"]
[13,"Butte","Northern",null,"Fee Title","Missing / Insufficient Data"]
[14,"Calaveras","Rural",null,"Land Sales Contract","Moderate Resource"]
[15,"Colusa","Rural",null,"Leasehold Interest","Moderate Resource (Rapidly Changing)"]
[16,"Contra Costa","Northern",null,"Other form of site control"]
[17,"Del Norte","Rural"]
[18,"El Dorado","Northern",null,"Federal"]
[19,"Fresno","Northern",null,"4% tax credits"]
[20,"Glenn","Rural",null,"9% tax credits"]
[21,"Humboldt","Rural",null,"Local"]
[22,"Imperial","Southern",null,"Local Fee Waiver"]
[23,"Inyo","Rural",null,"Local Land Donation"]
[24,"Kern","Southern",null,"Other"]
[25,"Kings","Northern",null,"Private"]
[26,"Lake","Rural",null,"State-General"]
[27,"Lassen","Rural",null,"State-GGRF"]
[28,"Los Angeles","Southern",null,"State-HCD"]
[29,"Madera","Northern"]
[30,"Marin","Northern",null,"Fixed for Term"]
[31,"Mariposa","Rural",null,"Fixed with Reset"]
[32,"Mendocino","Rural",null,"Fixed, then Variable"]
[33,"Merced","Northern",null,"Variable"]
[34,"Modoc","Rural",null,"Other"]
[35,"Mono","Rural",null,"None"]
[36,"Monterey","Northern"]
[37,"Napa","Northern"]
[38,"Nevada","Rural"]
[39,"Orange","Southern"]
[40,"Placer","Northern"]
[41,"Plumas","Rural"]
[42,"Riverside","Southern"]
[43,"Sacramento","Northern"]
[44,"San Benito","Northern"]
[45,"San Bernardino","Southern"]
[46,"San Diego","Southern"]
[47,"San Francisco","Northern"]
[48,"San Joaquin","Northern"]
[49,"San Luis Obispo","Southern"]
[50,"San Mateo","Northern"]
[51,"Santa Barbara","Southern"]
[52,"Santa Clara","Northern"]
[53,"Santa Cruz","Northern"]
[54,"Shasta","Northern"]
[55,"Sierra","Rural"]
[56,"Siskiyou","Rural"]
[57,"Solano","Northern"]
[58,"Sonoma","Northern"]
[59,"Stanislaus","Northern"]
[60,"Sutter","Northern"]
[61,"Tehama","Rural"]
[62,"Trinity","Rural"]
[63,"Tulare","Northern"]
[64,"Tuolumne","Rural"]
[65,"Ventura","Southern"]
[66,"Yolo","Northern"]
[67,"Yuba","Northern"]
[68]
[69]
[70]
[71]
[72]
[73]
[74]
[75]
[76]
[77]
[78]
[79]
[80]

{"sheet":"CountyScores","index":2,"n_rows":61,"n_cols":49,"rows_kept":61,"cut":false,"hidden":true,"merged":[[1,1,1,9],[1,10,1,18],[1,19,1,33],[1,47,1,48],[1,44,1,46],[1,39,1,43],[1,34,1,38]]}
[1,2,3,4,5,6,7,8,9,10,11,12,13,14,15,16,17,18,19,20,21,22,23,24,25,26,27,28,29,30,31,32,33,34,35,36,37,38,39,40,41,42,43,44,45,46,47,48,49]
[null,"Community Need: MA/SHTA/ADU/PDL/SHP/Serna MH",null,null,null,null,null,null,null,null,"Community Need: OOR",null,null,null,null,null,null,null,null,"Feasibility: MA (Only for Existing Homes Not Requiring Rehabilitation) Sales Data Collected 11/18/22",null,null,null,null,null,null,null,null,null,null,null,null,null,null,"Feasibility: OOR/ADU",null,null,null,null,"Feasibility: Shared Housing Technical Assistance",null,null,null,null,"Feasibility: PDL/Self-Help TA",null,null,"Farmworker Need"]
["County","Housing Affordability","Points Awarded","Percent of Low-Income Renter Households","Points Awarded2","Percent of Overcrowded Renter Households","Points Awarded3","Rental Vacancy Rate","Points Awarded4","Community Need Total Points","Age of Housing Stock","Points Awarded6","Percent of Homeowners in Poverty","Points Awarded7","Percent of Low-Income Homeowners","Points Awarded8","Percent of Overcrowded Homeowners","Points Awarded9","OOR Community Need Total Points","Median Owner to Renter Cost Ratio","Median Owner Renter Cost Ratio Points","Redfin.com \nMedian Sales Price (October 2024)","Realtor.com Median Sales Price (October 2024)","Zillow.com Median Sales Price (October 2024)","Lessor of $500,000 or Average from Redfin, Realtor, Zillow (October 2024)","Affordable Single Family Homes Sold In Last Year (November 2024)\n(Zillow.com)","CalHome Proposed Number of Loans (entered by Applicant)","Serna Proposed Number of Loans (entered by Applicant)","CalHome Annualized Home Sales/ Proposed # of Loans","Serna Annualized Home Sales/ Proposed # of Loans","CalHome Proposed Loans to Sales Ratio Points","Serna Proposed Loans to Sales Ratio Points","CalHome Feasibility Points Awarded","Serna Feasibility Points Awarded","Age of Housing Stock2","Points Awarded10","Percent of Overcrowded Homeowners11","Points Awarded12","OOR/ADU Total Feasibility Points Awarded","Renters <=80%AMI with Severe Cost Burden","Points Awarded11","Rental Vacancy Rate12","Points Awarded13","SHTA Total Feasibility Points Awarded","Median Owner Costs / Median Renter Costs Ratio","Points Awarded5","PDL/SHTA Feasibility Points Awarded","OMS Migrant Family Housing Centers In County","Farmworker Need Points Awarded"]
["Alameda",8.1310211946050099,3,0.53227099058801608,1,4.9594632373497344E-2,4,4.4315408866644104E-2,2,{"$f":"MIN(SUM(CountyScoresTbl[[#This Row],[Points Awarded]],CountyScoresTbl[[#This Row],[Points Awarded2]],CountyScoresTbl[[#This Row],[Points Awarded3]],CountyScoresTbl[[#This Row],[Points Awarded4]]),15)","v":10},null,null,2.4535484269223647E-2,2,null,null,0.26669538304457419,2,{"$f":"MIN(SUM(CountyScoresTbl[[#This Row],[Points Awarded6]],CountyScoresTbl[[#This Row],[Points Awarded7]],CountyScoresTbl[[#This Row],[Points Awarded8]],CountyScoresTbl[[#This Row],[Points Awarded9]]),15)","v":4},1.5912965455361148,4,1262000,882500,1109335.20452186,{"$f":"MIN(\n500000,\nAVERAGE(CountyScoresTbl[[#This Row],[Redfin.com \nMedian Sales Price (October 2024)]:[Zillow.com Median Sales Price (October 2024)]]))","v":500000},1192,{"$f":"'HDPL Unit Mix'!$G$16","v":0},{"$f":"'HDPL Unit Mix'!$H$16","v":0},{"$f":"IFERROR(\nCountyScoresTbl[[#This Row],[Affordable Single Family Homes Sold In Last Year (November 2024)\n(Zillow.com)]]/CountyScoresTbl[[#This Row],[CalHome Proposed Number of Loans (entered by Applicant)]],\n0)","v":0},{"$f":"IFERROR(\nCountyScoresTbl[[#This Row],[Affordable Single Family Homes Sold In Last Year (November 2024)\n(Zillow.com)]]/CountyScoresTbl[[#This Row],[Serna Proposed Number of Loans (entered by Applicant)]],\n0)","v":0},{"$f":"IF(AC4>=167, 10,\nIF(AC4>=73, 8,\nIF(AC4>=34, 6,\nIF(AC4>=11, 4,\n2))))","v":2},{"$f":"IF(AD4>=167, 10,\nIF(AD4>=73, 8,\nIF(AD4>=34, 6,\nIF(AD4>=11, 4,\n2))))","v":2},{"$f":"MIN(CountyScoresTbl[[#This Row],[Median Owner Renter Cost Ratio Points]]+CountyScoresTbl[[#This Row],[CalHome Proposed Loans to Sales Ratio Points]],15)","v":6},{"$f":"MIN(CountyScoresTbl[[#This Row],[Median Owner Renter Cost Ratio Points]]+CountyScoresTbl[[#This Row],[Serna Proposed Loans to Sales Ratio Points]],15)","v":6},0.78461242837477285,8,8.4394243961583865E-3,6,{"$f":"MIN(SUM(CountyScoresTbl[[#This Row],[Points Awarded10]],CountyScoresTbl[[#This Row],[Points Awarded12]]),15)","v":14},0.41685633250463949,6,4.4315408866644104E-2,4,{"$f":"MIN(SUM(CountyScoresTbl[[#This Row],[Points Awarded11]],CountyScoresTbl[[#This Row],[Points Awarded13]]),15)","v":10},1.6029411764705883,2,{"$f":"SUM(CountyScoresTbl[[#This Row],[Points Awarded5]],10)","v":12},0,{"$f":"IF(CountyScoresTbl[[#This Row],[OMS Migrant Family Housing Centers In County]]>=3,30,IF(CountyScoresTbl[[#This Row],[OMS Migrant Family Housing Centers In County]]=2,20,IF(CountyScoresTbl[[#This Row],[OMS Migrant Family Housing Centers In County]]=1,10,0)))","v":0}]
["Alpine",15,4,0.5625,1,0,1,0.27272727272727271,1,{"$f":"MIN(SUM(CountyScoresTbl[[#This Row],[Points Awarded]],CountyScoresTbl[[#This Row],[Points Awarded2]],CountyScoresTbl[[#This Row],[Points Awarded3]],CountyScoresTbl[[#This Row],[Points Awarded4]]),15)","v":7},null,null,6.25E-2,8,null,null,0.23943661971830985,2,{"$f":"MIN(SUM(CountyScoresTbl[[#This Row],[Points Awarded6]],CountyScoresTbl[[#This Row],[Points Awarded7]],CountyScoresTbl[[#This Row],[Points Awarded8]],CountyScoresTbl[[#This Row],[Points Awarded9]]),15)","v":10},3.7574334898278559,2,535000,479000,494572.17810300703,{"$f":"MIN(\n500000,\nAVERAGE(CountyScoresTbl[[#This Row],[Redfin.com \nMedian Sales Price (October 2024)]:[Zillow.com Median Sales Price (October 2024)]]))","v":500000},58,{"$f":"'HDPL Unit Mix'!$G$16","v":0},{"$f":"'HDPL Unit Mix'!$H$16","v":0},{"$f":"IFERROR(\nCountyScoresTbl[[#This Row],[Affordable Single Family Homes Sold In Last Year (November 2024)\n(Zillow.com)]]/CountyScoresTbl[[#This Row],[CalHome Proposed Number of Loans (entered by Applicant)]],\n0)","v":0},{"$f":"IFERROR(\nCountyScoresTbl[[#This Row],[Affordable Single Family Homes Sold In Last Year (November 2024)\n(Zillow.com)]]/CountyScoresTbl[[#This Row],[Serna Proposed Number of Loans (entered by Applicant)]],\n0)","v":0},2,2,{"$f":"MIN(CountyScoresTbl[[#This Row],[Median Owner Renter Cost Ratio Points]]+CountyScoresTbl[[#This Row],[CalHome Proposed Loans to Sales Ratio Points]],15)","v":4},{"$f":"MIN(CountyScoresTbl[[#This Row],[Median Owner Renter Cost Ratio Points]]+CountyScoresTbl[[#This Row],[Serna Proposed Loans to Sales Ratio Points]],15)","v":4},0.625,4,1.1267605633802818E-2,6,{"$f":"MIN(SUM(CountyScoresTbl[[#This Row],[Points Awarded10]],CountyScoresTbl[[#This Row],[Points Awarded12]]),15)","v":10},0.17777777777777778,2,0.27272727272727271,2,{"$f":"MIN(SUM(CountyScoresTbl[[#This Row],[Points Awarded11]],CountyScoresTbl[[#This Row],[Points Awarded13]]),15)","v":4},2.9937402190923317,1,{"$f":"SUM(CountyScoresTbl[[#This Row],[Points Awarded5]],10)","v":11},0,{"$f":"IF(CountyScoresTbl[[#This Row],[OMS Migrant Family Housing Centers In County]]>=3,30,IF(CountyScoresTbl[[#This Row],[OMS Migrant Family Housing Centers In County]]=2,20,IF(CountyScoresTbl[[#This Row],[OMS Migrant Family Housing Centers In County]]=1,10,0)))","v":0}]
["Amador",4.3179587831207069,1,0.60391566265060237,3,3.7650602409638557E-2,3,4.3227665706051875E-2,2,{"$f":"MIN(SUM(CountyScoresTbl[[#This Row],[Points Awarded]],CountyScoresTbl[[#This Row],[Points Awarded2]],CountyScoresTbl[[#This Row],[Points Awarded3]],CountyScoresTbl[[#This Row],[Points Awarded4]]),15)","v":9},null,null,3.8367631670735959E-2,4,null,null,0.34078674948240167,6,{"$f":"MIN(SUM(CountyScoresTbl[[#This Row],[Points Awarded6]],CountyScoresTbl[[#This Row],[Points Awarded7]],CountyScoresTbl[[#This Row],[Points Awarded8]],CountyScoresTbl[[#This Row],[Points Awarded9]]),15)","v":10},1.6420047732696896,4,430000,495000,425058.62674821902,{"$f":"MIN(\n500000,\nAVERAGE(CountyScoresTbl[[#This Row],[Redfin.com \nMedian Sales Price (October 2024)]:[Zillow.com Median Sales Price (October 2024)]]))","v":450019.5422494064},504,{"$f":"'HDPL Unit Mix'!$G$16","v":0},{"$f":"'HDPL Unit Mix'!$H$16","v":0},{"$f":"IFERROR(\nCountyScoresTbl[[#This Row],[Affordable Single Family Homes Sold In Last Year (November 2024)\n(Zillow.com)]]/CountyScoresTbl[[#This Row],[CalHome Proposed Number of Loans (entered by Applicant)]],\n0)","v":0},{"$f":"IFERROR(\nCountyScoresTbl[[#This Row],[Affordable Single Family Homes Sold In Last Year (November 2024)\n(Zillow.com)]]/CountyScoresTbl[[#This Row],[Serna Proposed Number of Loans (entered by Applicant)]],\n0)","v":0},2,2,{"$f":"MIN(CountyScoresTbl[[#This Row],[Median Owner Renter Cost Ratio Points]]+CountyScoresTbl[[#This Row],[CalHome Proposed Loans to Sales Ratio Points]],15)","v":6},{"$f":"MIN(CountyScoresTbl[[#This Row],[Median Owner Renter Cost Ratio Points]]+CountyScoresTbl[[#This Row],[Serna Proposed Loans to Sales Ratio Points]],15)","v":6},0.5787781350482315,4,5.7971014492753624E-3,4,{"$f":"MIN(SUM(CountyScoresTbl[[#This Row],[Points Awarded10]],CountyScoresTbl[[#This Row],[Points Awarded12]]),15)","v":8},0.24688279301745636,2,4.3227665706051875E-2,4,{"$f":"MIN(SUM(CountyScoresTbl[[#This Row],[Points Awarded11]],CountyScoresTbl[[#This Row],[Points Awarded13]]),15)","v":6},1.6480605487228004,2,{"$f":"SUM(CountyScoresTbl[[#This Row],[Points Awarded5]],10)","v":12},0,{"$f":"IF(CountyScoresTbl[[#This Row],[OMS Migrant Family Housing Centers In County]]>=3,30,IF(CountyScoresTbl[[#This Row],[OMS Migrant Family Housing Centers In County]]=2,20,IF(CountyScoresTbl[[#This Row],[OMS Migrant Family Housing Centers In County]]=1,10,0)))","v":0}]
["Butte",4.8033126293995858,2,0.60651839418100428,3,1.6365925304238357E-2,2,6.9140624999999997E-2,1,{"$f":"MIN(SUM(CountyScoresTbl[[#This Row],[Points Awarded]],CountyScoresTbl[[#This Row],[Points Awarded2]],CountyScoresTbl[[#This Row],[Points Awarded3]],CountyScoresTbl[[#This Row],[Points Awarded4]]),15)","v":8},null,null,4.8020169064214739E-2,6,null,null,0.29687184661957616,4,{"$f":"MIN(SUM(CountyScoresTbl[[#This Row],[Points Awarded6]],CountyScoresTbl[[#This Row],[Points Awarded7]],CountyScoresTbl[[#This Row],[Points Awarded8]],CountyScoresTbl[[#This Row],[Points Awarded9]]),15)","v":10},1.5101562500000001,6,439000,425750,395066.78251846501,{"$f":"MIN(\n500000,\nAVERAGE(CountyScoresTbl[[#This Row],[Redfin.com \nMedian Sales Price (October 2024)]:[Zillow.com Median Sales Price (October 2024)]]))","v":419938.92750615504},1812,{"$f":"'HDPL Unit Mix'!$G$16","v":0},{"$f":"'HDPL Unit Mix'!$H$16","v":0},{"$f":"IFERROR(\nCountyScoresTbl[[#This Row],[Affordable Single Family Homes Sold In Last Year (November 2024)\n(Zillow.com)]]/CountyScoresTbl[[#This Row],[CalHome Proposed Number of Loans (entered by Applicant)]],\n0)","v":0},{"$f":"IFERROR(\nCountyScoresTbl[[#This Row],[Affordable Single Family Homes Sold In Last Year (November 2024)\n(Zillow.com)]]/CountyScoresTbl[[#This Row],[Serna Proposed Number of Loans (entered by Applicant)]],\n0)","v":0},{"$f":"IF(AC7>=167, 10,\nIF(AC7>=73, 8,\nIF(AC7>=34, 6,\nIF(AC7>=11, 4,\n2))))","v":2},2,{"$f":"MIN(CountyScoresTbl[[#This Row],[Median Owner Renter Cost Ratio Points]]+CountyScoresTbl[[#This Row],[CalHome Proposed Loans to Sales Ratio Points]],15)","v":8},{"$f":"MIN(CountyScoresTbl[[#This Row],[Median Owner Renter Cost Ratio Points]]+CountyScoresTbl[[#This Row],[Serna Proposed Loans to Sales Ratio Points]],15)","v":8},0.65341566165537746,6,5.1463168516649848E-3,4,{"$f":"MIN(SUM(CountyScoresTbl[[#This Row],[Points Awarded10]],CountyScoresTbl[[#This Row],[Points Awarded12]]),15)","v":10},0.43380996309963099,8,6.9140624999999997E-2,2,{"$f":"MIN(SUM(CountyScoresTbl[[#This Row],[Points Awarded11]],CountyScoresTbl[[#This Row],[Points Awarded13]]),15)","v":10},1.5970561177552898,3,{"$f":"SUM(CountyScoresTbl[[#This Row],[Points Awarded5]],10)","v":13},0,{"$f":"IF(CountyScoresTbl[[#This Row],[OMS Migrant Family Housing Centers In County]]>=3,30,IF(CountyScoresTbl[[#This Row],[OMS Migrant Family Housing Centers In County]]=2,20,IF(CountyScoresTbl[[#This Row],[OMS Migrant Family Housing Centers In County]]=1,10,0)))","v":0}]
["Calaveras",4.5166320166320162,1,0.56430868167202575,2,6.4308681672025723E-3,1,4.7473200612557429E-2,1,{"$f":"MIN(SUM(CountyScoresTbl[[#This Row],[Points Awarded]],CountyScoresTbl[[#This Row],[Points Awarded2]],CountyScoresTbl[[#This Row],[Points Awarded3]],CountyScoresTbl[[#This Row],[Points Awarded4]]),15)","v":5},null,null,6.9025354285163404E-2,8,null,null,0.36678832116788324,8,{"$f":"MIN(SUM(CountyScoresTbl[[#This Row],[Points Awarded6]],CountyScoresTbl[[#This Row],[Points Awarded7]],CountyScoresTbl[[#This Row],[Points Awarded8]],CountyScoresTbl[[#This Row],[Points Awarded9]]),15)","v":15},1.2998149290561383,8,435500,532250,443815.29348022502,{"$f":"MIN(\n500000,\nAVERAGE(CountyScoresTbl[[#This Row],[Redfin.com \nMedian Sales Price (October 2024)]:[Zillow.com Median Sales Price (October 2024)]]))","v":470521.76449340832},632,{"$f":"'HDPL Unit Mix'!$G$16","v":0},{"$f":"'HDPL Unit Mix'!$H$16","v":0},{"$f":"IFERROR(\nCountyScoresTbl[[#This Row],[Affordable Single Family Homes Sold In Last Year (November 2024)\n(Zillow.com)]]/CountyScoresTbl[[#This Row],[CalHome Proposed Number of Loans (entered by Applicant)]],\n0)","v":0},{"$f":"IFERROR(\nCountyScoresTbl[[#This Row],[Affordable Single Family Homes Sold In Last Year (November 2024)\n(Zillow.com)]]/CountyScoresTbl[[#This Row],[Serna Proposed Number of Loans (entered by Applicant)]],\n0)","v":0},2,2,{"$f":"MIN(CountyScoresTbl[[#This Row],[Median Owner Renter Cost Ratio Points]]+CountyScoresTbl[[#This Row],[CalHome Proposed Loans to Sales Ratio Points]],15)","v":10},{"$f":"MIN(CountyScoresTbl[[#This Row],[Median Owner Renter Cost Ratio Points]]+CountyScoresTbl[[#This Row],[Serna Proposed Loans to Sales Ratio Points]],15)","v":10},0.4948986821595579,2,8.0291970802919711E-3,6,{"$f":"MIN(SUM(CountyScoresTbl[[#This Row],[Points Awarded10]],CountyScoresTbl[[#This Row],[Points Awarded12]]),15)","v":8},0.47863247863247865,8,4.7473200612557429E-2,2,{"$f":"MIN(SUM(CountyScoresTbl[[#This Row],[Points Awarded11]],CountyScoresTbl[[#This Row],[Points Awarded13]]),15)","v":10},1.4254062038404727,5,{"$f":"SUM(CountyScoresTbl[[#This Row],[Points Awarded5]],10)","v":15},0,{"$f":"IF(CountyScoresTbl[[#This Row],[OMS Migrant Family Housing Centers In County]]>=3,30,IF(CountyScoresTbl[[#This Row],[OMS Migrant Family Housing Centers In County]]=2,20,IF(CountyScoresTbl[[#This Row],[OMS Migrant Family Housing Centers In County]]=1,10,0)))","v":0}]
["Colusa",15,4,0.59180035650623886,2,2.4955436720142603E-2,2,3.7735849056603772E-2,2,{"$f":"MIN(SUM(CountyScoresTbl[[#This Row],[Points Awarded]],CountyScoresTbl[[#This Row],[Points Awarded2]],CountyScoresTbl[[#This Row],[Points Awarded3]],CountyScoresTbl[[#This Row],[Points Awarded4]]),15)","v":10},null,null,4.6111281893636641E-2,6,null,null,0.32814238042269189,6,{"$f":"MIN(SUM(CountyScoresTbl[[#This Row],[Points Awarded6]],CountyScoresTbl[[#This Row],[Points Awarded7]],CountyScoresTbl[[#This Row],[Points Awarded8]],CountyScoresTbl[[#This Row],[Points Awarded9]]),15)","v":12},1.7464655984919888,2,487000,525250,365470.39069059101,{"$f":"MIN(\n500000,\nAVERAGE(CountyScoresTbl[[#This Row],[Redfin.com \nMedian Sales Price (October 2024)]:[Zillow.com Median Sales Price (October 2024)]]))","v":459240.13023019698},74,{"$f":"'HDPL Unit Mix'!$G$16","v":0},{"$f":"'HDPL Unit Mix'!$H$16","v":0},{"$f":"IFERROR(\nCountyScoresTbl[[#This Row],[Affordable Single Family Homes Sold In Last Year (November 2024)\n(Zillow.com)]]/CountyScoresTbl[[#This Row],[CalHome Proposed Number of Loans (entered by Applicant)]],\n0)","v":0},{"$f":"IFERROR(\nCountyScoresTbl[[#This Row],[Affordable Single Family Homes Sold In Last Year (November 2024)\n(Zillow.com)]]/CountyScoresTbl[[#This Row],[Serna Proposed Number of Loans (entered by Applicant)]],\n0)","v":0},2,2,{"$f":"MIN(CountyScoresTbl[[#This Row],[Median Owner Renter Cost Ratio Points]]+CountyScoresTbl[[#This Row],[CalHome Proposed Loans to Sales Ratio Points]],15)","v":4},{"$f":"MIN(CountyScoresTbl[[#This Row],[Median Owner Renter Cost Ratio Points]]+CountyScoresTbl[[#This Row],[Serna Proposed Loans to Sales Ratio Points]],15)","v":4},0.65194195475885619,4,3.3370411568409346E-3,2,{"$f":"MIN(SUM(CountyScoresTbl[[#This Row],[Points Awarded10]],CountyScoresTbl[[#This Row],[Points Awarded12]]),15)","v":6},0.26807228915662651,2,3.7735849056603772E-2,4,{"$f":"MIN(SUM(CountyScoresTbl[[#This Row],[Points Awarded11]],CountyScoresTbl[[#This Row],[Points Awarded13]]),15)","v":6},1.7559912854030502,1,{"$f":"SUM(CountyScoresTbl[[#This Row],[Points Awarded5]],10)","v":11},1,{"$f":"IF(CountyScoresTbl[[#This Row],[OMS Migrant Family Housing Centers In County]]>=3,30,IF(CountyScoresTbl[[#This Row],[OMS Migrant Family Housing Centers In County]]=2,20,IF(CountyScoresTbl[[#This Row],[OMS Migrant Family Housing Centers In County]]=1,10,0)))","v":10}]
["Contra Costa",5.5844572896596016,3,0.57715460833800714,2,4.2849130678631518E-2,3,3.0802681645225583E-2,3,{"$f":"MIN(SUM(CountyScoresTbl[[#This Row],[Points Awarded]],CountyScoresTbl[[#This Row],[Points Awarded2]],CountyScoresTbl[[#This Row],[Points Awarded3]],CountyScoresTbl[[#This Row],[Points Awarded4]]),15)","v":11},null,null,2.8037517622349455E-2,2,null,null,0.29211806323236789,4,{"$f":"MIN(SUM(CountyScoresTbl[[#This Row],[Points Awarded6]],CountyScoresTbl[[#This Row],[Points Awarded7]],CountyScoresTbl[[#This Row],[Points Awarded8]],CountyScoresTbl[[#This Row],[Points Awarded9]]),15)","v":6},1.4395702775290957,6,860000,797000,807496.41178919503,{"$f":"MIN(\n500000,\nAVERAGE(CountyScoresTbl[[#This Row],[Redfin.com \nMedian Sales Price (October 2024)]:[Zillow.com Median Sales Price (October 2024)]]))","v":500000},1816,{"$f":"'HDPL Unit Mix'!$G$16","v":0},{"$f":"'HDPL Unit Mix'!$H$16","v":0},{"$f":"IFERROR(\nCountyScoresTbl[[#This Row],[Affordable Single Family Homes Sold In Last Year (November 2024)\n(Zillow.com)]]/CountyScoresTbl[[#This Row],[CalHome Proposed Number of Loans (entered by Applicant)]],\n0)","v":0},{"$f":"IFERROR(\nCountyScoresTbl[[#This Row],[Affordable Single Family Homes Sold In Last Year (November 2024)\n(Zillow.com)]]/CountyScoresTbl[[#This Row],[Serna Proposed Number of Loans (entered by Applicant)]],\n0)","v":0},2,2,{"$f":"MIN(CountyScoresTbl[[#This Row],[Median Owner Renter Cost Ratio Points]]+CountyScoresTbl[[#This Row],[CalHome Proposed Loans to Sales Ratio Points]],15)","v":8},{"$f":"MIN(CountyScoresTbl[[#This Row],[Median Owner Renter Cost Ratio Points]]+CountyScoresTbl[[#This Row],[Serna Proposed Loans to Sales Ratio Points]],15)","v":8},0.69210023761972095,6,6.1721571228535634E-3,4,{"$f":"MIN(SUM(CountyScoresTbl[[#This Row],[Points Awarded10]],CountyScoresTbl[[#This Row],[Points Awarded12]]),15)","v":10},0.41357864731795801,6,3.0802681645225583E-2,6,{"$f":"MIN(SUM(CountyScoresTbl[[#This Row],[Points Awarded11]],CountyScoresTbl[[#This Row],[Points Awarded13]]),15)","v":12},1.4636929460580912,5,{"$f":"SUM(CountyScoresTbl[[#This Row],[Points Awarded5]],10)","v":15},0,{"$f":"IF(CountyScoresTbl[[#This Row],[OMS Migrant Family Housing Centers In County]]>=3,30,IF(CountyScoresTbl[[#This Row],[OMS Migrant Family Housing Centers In County]]=2,20,IF(CountyScoresTbl[[#This Row],[OMS Migrant Family Housing Centers In County]]=1,10,0)))","v":0}]
["Del Norte",4.544937428896473,1,0.72727272727272729,4,8.2644628099173556E-3,1,0,4,{"$f":"MIN(SUM(CountyScoresTbl[[#This Row],[Points Awarded]],CountyScoresTbl[[#This Row],[Points Awarded2]],CountyScoresTbl[[#This Row],[Points Awarded3]],CountyScoresTbl[[#This Row],[Points Awarded4]]),15)","v":10},null,null,2.8482421005785491E-2,2,null,null,0.34050730207532665,6,{"$f":"MIN(SUM(CountyScoresTbl[[#This Row],[Points Awarded6]],CountyScoresTbl[[#This Row],[Points Awarded7]],CountyScoresTbl[[#This Row],[Points Awarded8]],CountyScoresTbl[[#This Row],[Points Awarded9]]),15)","v":8},1.3534031413612566,8,399500,449375,360278.64910795999,{"$f":"MIN(\n500000,\nAVERAGE(CountyScoresTbl[[#This Row],[Redfin.com \nMedian Sales Price (October 2024)]:[Zillow.com Median Sales Price (October 2024)]]))","v":403051.21636932},204,{"$f":"'HDPL Unit Mix'!$G$16","v":0},{"$f":"'HDPL Unit Mix'!$H$16","v":0},{"$f":"IFERROR(\nCountyScoresTbl[[#This Row],[Affordable Single Family Homes Sold In Last Year (November 2024)\n(Zillow.com)]]/CountyScoresTbl[[#This Row],[CalHome Proposed Number of Loans (entered by Applicant)]],\n0)","v":0},{"$f":"IFERROR(\nCountyScoresTbl[[#This Row],[Affordable Single Family Homes Sold In Last Year (November 2024)\n(Zillow.com)]]/CountyScoresTbl[[#This Row],[Serna Proposed Number of Loans (entered by Applicant)]],\n0)","v":0},2,2,{"$f":"MIN(CountyScoresTbl[[#This Row],[Median Owner Renter Cost Ratio Points]]+CountyScoresTbl[[#This Row],[CalHome Proposed Loans to Sales Ratio Points]],15)","v":10},{"$f":"MIN(CountyScoresTbl[[#This Row],[Median Owner Renter Cost Ratio Points]]+CountyScoresTbl[[#This Row],[Serna Proposed Loans to Sales Ratio Points]],15)","v":10},0.61598890942698703,4,4.6118370484242886E-3,2,{"$f":"MIN(SUM(CountyScoresTbl[[#This Row],[Points Awarded10]],CountyScoresTbl[[#This Row],[Points Awarded12]]),15)","v":6},0.41363636363636364,6,0,8,{"$f":"MIN(SUM(CountyScoresTbl[[#This Row],[Points Awarded11]],CountyScoresTbl[[#This Row],[Points Awarded13]]),15)","v":14},1.4799154334038056,4,{"$f":"SUM(CountyScoresTbl[[#This Row],[Points Awarded5]],10)","v":14},0,{"$f":"IF(CountyScoresTbl[[#This Row],[OMS Migrant Family Housing Centers In County]]>=3,30,IF(CountyScoresTbl[[#This Row],[OMS Migrant Family Housing Centers In County]]=2,20,IF(CountyScoresTbl[[#This Row],[OMS Migrant Family Housing Centers In County]]=1,10,0)))","v":0}]
["El Dorado",5.8296751536435467,3,0.59904198365736827,3,1.5497323189630883E-2,1,6.7034700315457413E-2,1,{"$f":"MIN(SUM(CountyScoresTbl[[#This Row],[Points Awarded]],CountyScoresTbl[[#This Row],[Points Awarded2]],CountyScoresTbl[[#This Row],[Points Awarded3]],CountyScoresTbl[[#This Row],[Points Awarded4]]),15)","v":8},null,null,3.3831127468327553E-2,2,null,null,0.27416798732171155,2,{"$f":"MIN(SUM(CountyScoresTbl[[#This Row],[Points Awarded6]],CountyScoresTbl[[#This Row],[Points Awarded7]],CountyScoresTbl[[#This Row],[Points Awarded8]],CountyScoresTbl[[#This Row],[Points Awarded9]]),15)","v":4},1.7100814026299311,2,664500,697475,656655.09603911301,{"$f":"MIN(\n500000,\nAVERAGE(CountyScoresTbl[[#This Row],[Redfin.com \nMedian Sales Price (October 2024)]:[Zillow.com Median Sales Price (October 2024)]]))","v":500000},1048,{"$f":"'HDPL Unit Mix'!$G$16","v":0},{"$f":"'HDPL Unit Mix'!$H$16","v":0},{"$f":"IFERROR(\nCountyScoresTbl[[#This Row],[Affordable Single Family Homes Sold In Last Year (November 2024)\n(Zillow.com)]]/CountyScoresTbl[[#This Row],[CalHome Proposed Number of Loans (entered by Applicant)]],\n0)","v":0},{"$f":"IFERROR(\nCountyScoresTbl[[#This Row],[Affordable Single Family Homes Sold In Last Year (November 2024)\n(Zillow.com)]]/CountyScoresTbl[[#This Row],[Serna Proposed Number of Loans (entered by Applicant)]],\n0)","v":0},2,2,{"$f":"MIN(CountyScoresTbl[[#This Row],[Median Owner Renter Cost Ratio Points]]+CountyScoresTbl[[#This Row],[CalHome Proposed Loans to Sales Ratio Points]],15)","v":4},{"$f":"MIN(CountyScoresTbl[[#This Row],[Median Owner Renter Cost Ratio Points]]+CountyScoresTbl[[#This Row],[Serna Proposed Loans to Sales Ratio Points]],15)","v":4},0.57443871756792175,2,3.7858777953865119E-3,2,{"$f":"MIN(SUM(CountyScoresTbl[[#This Row],[Points Awarded10]],CountyScoresTbl[[#This Row],[Points Awarded12]]),15)","v":4},0.40498588899341487,6,6.7034700315457413E-2,2,{"$f":"MIN(SUM(CountyScoresTbl[[#This Row],[Points Awarded11]],CountyScoresTbl[[#This Row],[Points Awarded13]]),15)","v":8},1.7886363636363636,1,{"$f":"SUM(CountyScoresTbl[[#This Row],[Points Awarded5]],10)","v":11},0,{"$f":"IF(CountyScoresTbl[[#This Row],[OMS Migrant Family Housing Centers In County]]>=3,30,IF(CountyScoresTbl[[#This Row],[OMS Migrant Family Housing Centers In County]]=2,20,IF(CountyScoresTbl[[#This Row],[OMS Migrant Family Housing Centers In County]]=1,10,0)))","v":0}]
["Fresno",4.6700796359499428,2,0.62690030127783358,3,7.7293347646916227E-2,4,3.1363209445860726E-2,3,{"$f":"MIN(SUM(CountyScoresTbl[[#This Row],[Points Awarded]],CountyScoresTbl[[#This Row],[Points Awarded2]],CountyScoresTbl[[#This Row],[Points Awarded3]],CountyScoresTbl[[#This Row],[Points Awarded4]]),15)","v":12},null,null,6.5457950927139907E-2,8,null,null,0.27003264033875379,2,{"$f":"MIN(SUM(CountyScoresTbl[[#This Row],[Points Awarded6]],CountyScoresTbl[[#This Row],[Points Awarded7]],CountyScoresTbl[[#This Row],[Points Awarded8]],CountyScoresTbl[[#This Row],[Points Awarded9]]),15)","v":10},1.571665285832643,4,410500,460000,395072.82155666797,{"$f":"MIN(\n500000,\nAVERAGE(CountyScoresTbl[[#This Row],[Redfin.com \nMedian Sales Price (October 2024)]:[Zillow.com Median Sales Price (October 2024)]]))","v":421857.60718555603},4623,{"$f":"'HDPL Unit Mix'!$G$16","v":0},{"$f":"'HDPL Unit Mix'!$H$16","v":0},{"$f":"IFERROR(\nCountyScoresTbl[[#This Row],[Affordable Single Family Homes Sold In Last Year (November 2024)\n(Zillow.com)]]/CountyScoresTbl[[#This Row],[CalHome Proposed Number of Loans (entered by Applicant)]],\n0)","v":0},{"$f":"IFERROR(\nCountyScoresTbl[[#This Row],[Affordable Single Family Homes Sold In Last Year (November 2024)\n(Zillow.com)]]/CountyScoresTbl[[#This Row],[Serna Proposed Number of Loans (entered by Applicant)]],\n0)","v":0},2,2,{"$f":"MIN(CountyScoresTbl[[#This Row],[Median Owner Renter Cost Ratio Points]]+CountyScoresTbl[[#This Row],[CalHome Proposed Loans to Sales Ratio Points]],15)","v":6},{"$f":"MIN(CountyScoresTbl[[#This Row],[Median Owner Renter Cost Ratio Points]]+CountyScoresTbl[[#This Row],[Serna Proposed Loans to Sales Ratio Points]],15)","v":6},0.56840915021309912,2,1.4026523950951275E-2,8,{"$f":"MIN(SUM(CountyScoresTbl[[#This Row],[Points Awarded10]],CountyScoresTbl[[#This Row],[Points Awarded12]]),15)","v":10},0.40070706512732696,6,3.1363209445860726E-2,6,{"$f":"MIN(SUM(CountyScoresTbl[[#This Row],[Points Awarded11]],CountyScoresTbl[[#This Row],[Points Awarded13]]),15)","v":12},1.6132167152575316,2,{"$f":"SUM(CountyScoresTbl[[#This Row],[Points Awarded5]],10)","v":12},1,{"$f":"IF(CountyScoresTbl[[#This Row],[OMS Migrant Family Housing Centers In County]]>=3,30,IF(CountyScoresTbl[[#This Row],[OMS Migrant Family Housing Centers In County]]=2,20,IF(CountyScoresTbl[[#This Row],[OMS Migrant Family Housing Centers In County]]=1,10,0)))","v":10}]
["Glenn",4.0216154721274178,1,0.67496723460026209,4,9.1743119266055051E-3,1,7.2904009720534624E-2,1,{"$f":"MIN(SUM(CountyScoresTbl[[#This Row],[Points Awarded]],CountyScoresTbl[[#This Row],[Points Awarded2]],CountyScoresTbl[[#This Row],[Points Awarded3]],CountyScoresTbl[[#This Row],[Points Awarded4]]),15)","v":7},null,null,3.5925612848689774E-2,4,null,null,0.32266217354675653,6,{"$f":"MIN(SUM(CountyScoresTbl[[#This Row],[Points Awarded6]],CountyScoresTbl[[#This Row],[Points Awarded7]],CountyScoresTbl[[#This Row],[Points Awarded8]],CountyScoresTbl[[#This Row],[Points Awarded9]]),15)","v":10},1.7259713701431494,2,353500,390750,353746.72254425503,{"$f":"MIN(\n500000,\nAVERAGE(CountyScoresTbl[[#This Row],[Redfin.com \nMedian Sales Price (October 2024)]:[Zillow.com Median Sales Price (October 2024)]]))","v":365998.90751475166},147,{"$f":"'HDPL Unit Mix'!$G$16","v":0},{"$f":"'HDPL Unit Mix'!$H$16","v":0},{"$f":"IFERROR(\nCountyScoresTbl[[#This Row],[Affordable Single Family Homes Sold In Last Year (November 2024)\n(Zillow.com)]]/CountyScoresTbl[[#This Row],[CalHome Proposed Number of Loans (entered by Applicant)]],\n0)","v":0},{"$f":"IFERROR(\nCountyScoresTbl[[#This Row],[Affordable Single Family Homes Sold In Last Year (November 2024)\n(Zillow.com)]]/CountyScoresTbl[[#This Row],[Serna Proposed Number of Loans (entered by Applicant)]],\n0)","v":0},2,2,{"$f":"MIN(CountyScoresTbl[[#This Row],[Median Owner Renter Cost Ratio Points]]+CountyScoresTbl[[#This Row],[CalHome Proposed Loans to Sales Ratio Points]],15)","v":4},{"$f":"MIN(CountyScoresTbl[[#This Row],[Median Owner Renter Cost Ratio Points]]+CountyScoresTbl[[#This Row],[Serna Proposed Loans to Sales Ratio Points]],15)","v":4},0.65187944463257708,4,6.7396798652064023E-3,4,{"$f":"MIN(SUM(CountyScoresTbl[[#This Row],[Points Awarded10]],CountyScoresTbl[[#This Row],[Points Awarded12]]),15)","v":8},0.37281553398058254,4,7.2904009720534624E-2,2,{"$f":"MIN(SUM(CountyScoresTbl[[#This Row],[Points Awarded11]],CountyScoresTbl[[#This Row],[Points Awarded13]]),15)","v":6},1.8592592592592592,1,{"$f":"SUM(CountyScoresTbl[[#This Row],[Points Awarded5]],10)","v":11},0,{"$f":"IF(CountyScoresTbl[[#This Row],[OMS Migrant Family Housing Centers In County]]>=3,30,IF(CountyScoresTbl[[#This Row],[OMS Migrant Family Housing Centers In County]]=2,20,IF(CountyScoresTbl[[#This Row],[OMS Migrant Family Housing Centers In County]]=1,10,0)))","v":0}]
["Humboldt",4.9263873159682898,2,0.65899122807017541,4,2.7192982456140352E-2,2,2.8960817717206135E-2,3,{"$f":"MIN(SUM(CountyScoresTbl[[#This Row],[Points Awarded]],CountyScoresTbl[[#This Row],[Points Awarded2]],CountyScoresTbl[[#This Row],[Points Awarded3]],CountyScoresTbl[[#This Row],[Points Awarded4]]),15)","v":11},null,null,6.8658359605664812E-2,8,null,null,0.32282573553184613,6,{"$f":"MIN(SUM(CountyScoresTbl[[#This Row],[Points Awarded6]],CountyScoresTbl[[#This Row],[Points Awarded7]],CountyScoresTbl[[#This Row],[Points Awarded8]],CountyScoresTbl[[#This Row],[Points Awarded9]]),15)","v":14},1.6591099916036944,4,435000,479250,432568.16417574201,{"$f":"MIN(\n500000,\nAVERAGE(CountyScoresTbl[[#This Row],[Redfin.com \nMedian Sales Price (October 2024)]:[Zillow.com Median Sales Price (October 2024)]]))","v":448939.38805858069},914,{"$f":"'HDPL Unit Mix'!$G$16","v":0},{"$f":"'HDPL Unit Mix'!$H$16","v":0},{"$f":"IFERROR(\nCountyScoresTbl[[#This Row],[Affordable Single Family Homes Sold In Last Year (November 2024)\n(Zillow.com)]]/CountyScoresTbl[[#This Row],[CalHome Proposed Number of Loans (entered by Applicant)]],\n0)","v":0},{"$f":"IFERROR(\nCountyScoresTbl[[#This Row],[Affordable Single Family Homes Sold In Last Year (November 2024)\n(Zillow.com)]]/CountyScoresTbl[[#This Row],[Serna Proposed Number of Loans (entered by Applicant)]],\n0)","v":0},2,2,{"$f":"MIN(CountyScoresTbl[[#This Row],[Median Owner Renter Cost Ratio Points]]+CountyScoresTbl[[#This Row],[CalHome Proposed Loans to Sales Ratio Points]],15)","v":6},{"$f":"MIN(CountyScoresTbl[[#This Row],[Median Owner Renter Cost Ratio Points]]+CountyScoresTbl[[#This Row],[Serna Proposed Loans to Sales Ratio Points]],15)","v":6},0.74177296948167282,8,9.2143549951503399E-3,6,{"$f":"MIN(SUM(CountyScoresTbl[[#This Row],[Points Awarded10]],CountyScoresTbl[[#This Row],[Points Awarded12]]),15)","v":14},0.4885191347753744,8,2.8960817717206135E-2,6,{"$f":"MIN(SUM(CountyScoresTbl[[#This Row],[Points Awarded11]],CountyScoresTbl[[#This Row],[Points Awarded13]]),15)","v":14},1.7754491017964071,1,{"$f":"SUM(CountyScoresTbl[[#This Row],[Points Awarded5]],10)","v":11},0,{"$f":"IF(CountyScoresTbl[[#This Row],[OMS Migrant Family Housing Centers In County]]>=3,30,IF(CountyScoresTbl[[#This Row],[OMS Migrant Family Housing Centers In County]]=2,20,IF(CountyScoresTbl[[#This Row],[OMS Migrant Family Housing Centers In County]]=1,10,0)))","v":0}]
["Imperial",4.4367463026166094,1,0.73002610966057446,4,4.4647519582245429E-2,4,3.2339565437089442E-2,3,{"$f":"MIN(SUM(CountyScoresTbl[[#This Row],[Points Awarded]],CountyScoresTbl[[#This Row],[Points Awarded2]],CountyScoresTbl[[#This Row],[Points Awarded3]],CountyScoresTbl[[#This Row],[Points Awarded4]]),15)","v":12},null,null,8.3181201142161681E-2,8,null,null,0.38328912466843501,8,{"$f":"MIN(SUM(CountyScoresTbl[[#This Row],[Points Awarded6]],CountyScoresTbl[[#This Row],[Points Awarded7]],CountyScoresTbl[[#This Row],[Points Awarded8]],CountyScoresTbl[[#This Row],[Points Awarded9]]),15)","v":15},1.7533818938605619,2,350000,356175,347153.34649046097,{"$f":"MIN(\n500000,\nAVERAGE(CountyScoresTbl[[#This Row],[Redfin.com \nMedian Sales Price (October 2024)]:[Zillow.com Median Sales Price (October 2024)]]))","v":351109.44883015362},1128,{"$f":"'HDPL Unit Mix'!$G$16","v":0},{"$f":"'HDPL Unit Mix'!$H$16","v":0},{"$f":"IFERROR(\nCountyScoresTbl[[#This Row],[Affordable Single Family Homes Sold In Last Year (November 2024)\n(Zillow.com)]]/CountyScoresTbl[[#This Row],[CalHome Proposed Number of Loans (entered by Applicant)]],\n0)","v":0},{"$f":"IFERROR(\nCountyScoresTbl[[#This Row],[Affordable Single Family Homes Sold In Last Year (November 2024)\n(Zillow.com)]]/CountyScoresTbl[[#This Row],[Serna Proposed Number of Loans (entered by Applicant)]],\n0)","v":0},2,2,{"$f":"MIN(CountyScoresTbl[[#This Row],[Median Owner Renter Cost Ratio Points]]+CountyScoresTbl[[#This Row],[CalHome Proposed Loans to Sales Ratio Points]],15)","v":4},{"$f":"MIN(CountyScoresTbl[[#This Row],[Median Owner Renter Cost Ratio Points]]+CountyScoresTbl[[#This Row],[Serna Proposed Loans to Sales Ratio Points]],15)","v":4},0.49174102204852149,2,2.5198938992042442E-2,8,{"$f":"MIN(SUM(CountyScoresTbl[[#This Row],[Points Awarded10]],CountyScoresTbl[[#This Row],[Points Awarded12]]),15)","v":10},0.34406294706723889,2,3.2339565437089442E-2,6,{"$f":"MIN(SUM(CountyScoresTbl[[#This Row],[Points Awarded11]],CountyScoresTbl[[#This Row],[Points Awarded13]]),15)","v":8},1.7272727272727273,1,{"$f":"SUM(CountyScoresTbl[[#This Row],[Points Awarded5]],10)","v":11},0,{"$f":"IF(CountyScoresTbl[[#This Row],[OMS Migrant Family Housing Centers In County]]>=3,30,IF(CountyScoresTbl[[#This Row],[OMS Migrant Family Housing Centers In County]]=2,20,IF(CountyScoresTbl[[#This Row],[OMS Migrant Family Housing Centers In County]]=1,10,0)))","v":0}]
["Inyo",15,4,0.44982078853046598,1,1.0752688172043012E-2,1,3.4602076124567477E-2,3,{"$f":"MIN(SUM(CountyScoresTbl[[#This Row],[Points Awarded]],CountyScoresTbl[[#This Row],[Points Awarded2]],CountyScoresTbl[[#This Row],[Points Awarded3]],CountyScoresTbl[[#This Row],[Points Awarded4]]),15)","v":9},null,null,0.10082547169811321,8,null,null,0.36967294350842417,8,{"$f":"MIN(SUM(CountyScoresTbl[[#This Row],[Points Awarded6]],CountyScoresTbl[[#This Row],[Points Awarded7]],CountyScoresTbl[[#This Row],[Points Awarded8]],CountyScoresTbl[[#This Row],[Points Awarded9]]),15)","v":15},1.9133510167992926,2,449000,649900,492278.11106139299,{"$f":"MIN(\n500000,\nAVERAGE(CountyScoresTbl[[#This Row],[Redfin.com \nMedian Sales Price (October 2024)]:[Zillow.com Median Sales Price (October 2024)]]))","v":500000},253,{"$f":"'HDPL Unit Mix'!$G$16","v":0},{"$f":"'HDPL Unit Mix'!$H$16","v":0},{"$f":"IFERROR(\nCountyScoresTbl[[#This Row],[Affordable Single Family Homes Sold In Last Year (November 2024)\n(Zillow.com)]]/CountyScoresTbl[[#This Row],[CalHome Proposed Number of Loans (entered by Applicant)]],\n0)","v":0},{"$f":"IFERROR(\nCountyScoresTbl[[#This Row],[Affordable Single Family Homes Sold In Last Year (November 2024)\n(Zillow.com)]]/CountyScoresTbl[[#This Row],[Serna Proposed Number of Loans (entered by Applicant)]],\n0)","v":0},2,2,{"$f":"MIN(CountyScoresTbl[[#This Row],[Median Owner Renter Cost Ratio Points]]+CountyScoresTbl[[#This Row],[CalHome Proposed Loans to Sales Ratio Points]],15)","v":4},{"$f":"MIN(CountyScoresTbl[[#This Row],[Median Owner Renter Cost Ratio Points]]+CountyScoresTbl[[#This Row],[Serna Proposed Loans to Sales Ratio Points]],15)","v":4},0.81942835071456166,8,2.973240832507433E-3,2,{"$f":"MIN(SUM(CountyScoresTbl[[#This Row],[Points Awarded10]],CountyScoresTbl[[#This Row],[Points Awarded12]]),15)","v":10},0.27490039840637448,2,3.4602076124567477E-2,6,{"$f":"MIN(SUM(CountyScoresTbl[[#This Row],[Points Awarded11]],CountyScoresTbl[[#This Row],[Points Awarded13]]),15)","v":8},1.9680170575692963,1,{"$f":"SUM(CountyScoresTbl[[#This Row],[Points Awarded5]],10)","v":11},0,{"$f":"IF(CountyScoresTbl[[#This Row],[OMS Migrant Family Housing Centers In County]]>=3,30,IF(CountyScoresTbl[[#This Row],[OMS Migrant Family Housing Centers In County]]=2,20,IF(CountyScoresTbl[[#This Row],[OMS Migrant Family Housing Centers In County]]=1,10,0)))","v":0}]
["Kern",4.544937428896473,1,0.64304227366163191,4,5.1345071051925997E-2,4,4.0312205163393088E-2,2,{"$f":"MIN(SUM(CountyScoresTbl[[#This Row],[Points Awarded]],CountyScoresTbl[[#This Row],[Points Awarded2]],CountyScoresTbl[[#This Row],[Points Awarded3]],CountyScoresTbl[[#This Row],[Points Awarded4]]),15)","v":11},null,null,7.8141941079892197E-2,8,null,null,0.32275895955532352,6,{"$f":"MIN(SUM(CountyScoresTbl[[#This Row],[Points Awarded6]],CountyScoresTbl[[#This Row],[Points Awarded7]],CountyScoresTbl[[#This Row],[Points Awarded8]],CountyScoresTbl[[#This Row],[Points Awarded9]]),15)","v":14},1.5572782084409991,4,377000,399995,355449.72878453101,{"$f":"MIN(\n500000,\nAVERAGE(CountyScoresTbl[[#This Row],[Redfin.com \nMedian Sales Price (October 2024)]:[Zillow.com Median Sales Price (October 2024)]]))","v":377481.57626151032},4540,{"$f":"'HDPL Unit Mix'!$G$16","v":0},{"$f":"'HDPL Unit Mix'!$H$16","v":0},{"$f":"IFERROR(\nCountyScoresTbl[[#This Row],[Affordable Single Family Homes Sold In Last Year (November 2024)\n(Zillow.com)]]/CountyScoresTbl[[#This Row],[CalHome Proposed Number of Loans (entered by Applicant)]],\n0)","v":0},{"$f":"IFERROR(\nCountyScoresTbl[[#This Row],[Affordable Single Family Homes Sold In Last Year (November 2024)\n(Zillow.com)]]/CountyScoresTbl[[#This Row],[Serna Proposed Number of Loans (entered by Applicant)]],\n0)","v":0},2,2,{"$f":"MIN(CountyScoresTbl[[#This Row],[Median Owner Renter Cost Ratio Points]]+CountyScoresTbl[[#This Row],[CalHome Proposed Loans to Sales Ratio Points]],15)","v":6},{"$f":"MIN(CountyScoresTbl[[#This Row],[Median Owner Renter Cost Ratio Points]]+CountyScoresTbl[[#This Row],[Serna Proposed Loans to Sales Ratio Points]],15)","v":6},0.54929202951538925,2,1.5109172987746829E-2,8,{"$f":"MIN(SUM(CountyScoresTbl[[#This Row],[Points Awarded10]],CountyScoresTbl[[#This Row],[Points Awarded12]]),15)","v":10},0.37074357192494789,4,4.0312205163393088E-2,4,{"$f":"MIN(SUM(CountyScoresTbl[[#This Row],[Points Awarded11]],CountyScoresTbl[[#This Row],[Points Awarded13]]),15)","v":8},1.5955734406438631,3,{"$f":"SUM(CountyScoresTbl[[#This Row],[Points Awarded5]],10)","v":13},2,{"$f":"IF(CountyScoresTbl[[#This Row],[OMS Migrant Family Housing Centers In County]]>=3,30,IF(CountyScoresTbl[[#This Row],[OMS Migrant Family Housing Centers In County]]=2,20,IF(CountyScoresTbl[[#This Row],[OMS Migrant Family Housing Centers In County]]=1,10,0)))","v":20}]
["Kings",3.8680318543799772,1,0.56010165184243965,1,3.4815756035578148E-2,3,1.6495876030992253E-2,4,{"$f":"MIN(SUM(CountyScoresTbl[[#This Row],[Points Awarded]],CountyScoresTbl[[#This Row],[Points Awarded2]],CountyScoresTbl[[#This Row],[Points Awarded3]],CountyScoresTbl[[#This Row],[Points Awarded4]]),15)","v":9},null,null,7.4235355106272674E-2,8,null,null,0.27933079203727235,2,{"$f":"MIN(SUM(CountyScoresTbl[[#This Row],[Points Awarded6]],CountyScoresTbl[[#This Row],[Points Awarded7]],CountyScoresTbl[[#This Row],[Points Awarded8]],CountyScoresTbl[[#This Row],[Points Awarded9]]),15)","v":10},1.4329725228975854,8,345000,367000,346898.78899804398,{"$f":"MIN(\n500000,\nAVERAGE(CountyScoresTbl[[#This Row],[Redfin.com \nMedian Sales Price (October 2024)]:[Zillow.com Median Sales Price (October 2024)]]))","v":352966.26299934805},629,{"$f":"'HDPL Unit Mix'!$G$16","v":0},{"$f":"'HDPL Unit Mix'!$H$16","v":0},{"$f":"IFERROR(\nCountyScoresTbl[[#This Row],[Affordable Single Family Homes Sold In Last Year (November 2024)\n(Zillow.com)]]/CountyScoresTbl[[#This Row],[CalHome Proposed Number of Loans (entered by Applicant)]],\n0)","v":0},{"$f":"IFERROR(\nCountyScoresTbl[[#This Row],[Affordable Single Family Homes Sold In Last Year (November 2024)\n(Zillow.com)]]/CountyScoresTbl[[#This Row],[Serna Proposed Number of Loans (entered by Applicant)]],\n0)","v":0},2,2,{"$f":"MIN(CountyScoresTbl[[#This Row],[Median Owner Renter Cost Ratio Points]]+CountyScoresTbl[[#This Row],[CalHome Proposed Loans to Sales Ratio Points]],15)","v":10},{"$f":"MIN(CountyScoresTbl[[#This Row],[Median Owner Renter Cost Ratio Points]]+CountyScoresTbl[[#This Row],[Serna Proposed Loans to Sales Ratio Points]],15)","v":10},0.51454606253134927,2,1.1012282930961457E-2,6,{"$f":"MIN(SUM(CountyScoresTbl[[#This Row],[Points Awarded10]],CountyScoresTbl[[#This Row],[Points Awarded12]]),15)","v":8},0.32622504537205083,2,1.6495876030992253E-2,8,{"$f":"MIN(SUM(CountyScoresTbl[[#This Row],[Points Awarded11]],CountyScoresTbl[[#This Row],[Points Awarded13]]),15)","v":10},1.4349514563106796,5,{"$f":"SUM(CountyScoresTbl[[#This Row],[Points Awarded5]],10)","v":15},0,{"$f":"IF(CountyScoresTbl[[#This Row],[OMS Migrant Family Housing Centers In County]]>=3,30,IF(CountyScoresTbl[[#This Row],[OMS Migrant Family Housing Centers In County]]=2,20,IF(CountyScoresTbl[[#This Row],[OMS Migrant Family Housing Centers In County]]=1,10,0)))","v":0}]
["Lake",3.8680318543799772,1,0.61278426551936083,3,2.3970497848801474E-2,2,2.8656716417910448E-2,4,{"$f":"MIN(SUM(CountyScoresTbl[[#This Row],[Points Awarded]],CountyScoresTbl[[#This Row],[Points Awarded2]],CountyScoresTbl[[#This Row],[Points Awarded3]],CountyScoresTbl[[#This Row],[Points Awarded4]]),15)","v":10},null,null,4.8399824638316526E-2,6,null,null,0.37606602475928474,8,{"$f":"MIN(SUM(CountyScoresTbl[[#This Row],[Points Awarded6]],CountyScoresTbl[[#This Row],[Points Awarded7]],CountyScoresTbl[[#This Row],[Points Awarded8]],CountyScoresTbl[[#This Row],[Points Awarded9]]),15)","v":14},1.5033167495854063,6,345000,397500,316496.90354641702,{"$f":"MIN(\n500000,\nAVERAGE(CountyScoresTbl[[#This Row],[Redfin.com \nMedian Sales Price (October 2024)]:[Zillow.com Median Sales Price (October 2024)]]))","v":352998.96784880571},1108,{"$f":"'HDPL Unit Mix'!$G$16","v":0},{"$f":"'HDPL Unit Mix'!$H$16","v":0},{"$f":"IFERROR(\nCountyScoresTbl[[#This Row],[Affordable Single Family Homes Sold In Last Year (November 2024)\n(Zillow.com)]]/CountyScoresTbl[[#This Row],[CalHome Proposed Number of Loans (entered by Applicant)]],\n0)","v":0},{"$f":"IFERROR(\nCountyScoresTbl[[#This Row],[Affordable Single Family Homes Sold In Last Year (November 2024)\n(Zillow.com)]]/CountyScoresTbl[[#This Row],[Serna Proposed Number of Loans (entered by Applicant)]],\n0)","v":0},2,2,{"$f":"MIN(CountyScoresTbl[[#This Row],[Median Owner Renter Cost Ratio Points]]+CountyScoresTbl[[#This Row],[CalHome Proposed Loans to Sales Ratio Points]],15)","v":8},{"$f":"MIN(CountyScoresTbl[[#This Row],[Median Owner Renter Cost Ratio Points]]+CountyScoresTbl[[#This Row],[Serna Proposed Loans to Sales Ratio Points]],15)","v":8},0.66644951140065145,6,1.1279229711141679E-2,6,{"$f":"MIN(SUM(CountyScoresTbl[[#This Row],[Points Awarded10]],CountyScoresTbl[[#This Row],[Points Awarded12]]),15)","v":12},0.35205616850551658,2,2.8656716417910448E-2,8,{"$f":"MIN(SUM(CountyScoresTbl[[#This Row],[Points Awarded11]],CountyScoresTbl[[#This Row],[Points Awarded13]]),15)","v":10},1.5535019455252919,3,{"$f":"SUM(CountyScoresTbl[[#This Row],[Points Awarded5]],10)","v":13},0,{"$f":"IF(CountyScoresTbl[[#This Row],[OMS Migrant Family Housing Centers In County]]>=3,30,IF(CountyScoresTbl[[#This Row],[OMS Migrant Family Housing Centers In County]]=2,20,IF(CountyScoresTbl[[#This Row],[OMS Migrant Family Housing Centers In County]]=1,10,0)))","v":0}]
["Lassen",3.2138794084186575,1,0.63738317757009344,3,5.6074766355140183E-3,1,5.1418439716312055E-2,1,{"$f":"MIN(SUM(CountyScoresTbl[[#This Row],[Points Awarded]],CountyScoresTbl[[#This Row],[Points Awarded2]],CountyScoresTbl[[#This Row],[Points Awarded3]],CountyScoresTbl[[#This Row],[Points Awarded4]]),15)","v":6},null,null,8.7938491110043246E-2,8,null,null,0.31595829991980756,4,{"$f":"MIN(SUM(CountyScoresTbl[[#This Row],[Points Awarded6]],CountyScoresTbl[[#This Row],[Points Awarded7]],CountyScoresTbl[[#This Row],[Points Awarded8]],CountyScoresTbl[[#This Row],[Points Awarded9]]),15)","v":12},1.5597302504816957,4,227500,299450,229647.83214621601,{"$f":"MIN(\n500000,\nAVERAGE(CountyScoresTbl[[#This Row],[Redfin.com \nMedian Sales Price (October 2024)]:[Zillow.com Median Sales Price (October 2024)]]))","v":252199.27738207197},261,{"$f":"'HDPL Unit Mix'!$G$16","v":0},{"$f":"'HDPL Unit Mix'!$H$16","v":0},{"$f":"IFERROR(\nCountyScoresTbl[[#This Row],[Affordable Single Family Homes Sold In Last Year (November 2024)\n(Zillow.com)]]/CountyScoresTbl[[#This Row],[CalHome Proposed Number of Loans (entered by Applicant)]],\n0)","v":0},{"$f":"IFERROR(\nCountyScoresTbl[[#This Row],[Affordable Single Family Homes Sold In Last Year (November 2024)\n(Zillow.com)]]/CountyScoresTbl[[#This Row],[Serna Proposed Number of Loans (entered by Applicant)]],\n0)","v":0},2,2,{"$f":"MIN(CountyScoresTbl[[#This Row],[Median Owner Renter Cost Ratio Points]]+CountyScoresTbl[[#This Row],[CalHome Proposed Loans to Sales Ratio Points]],15)","v":6},{"$f":"MIN(CountyScoresTbl[[#This Row],[Median Owner Renter Cost Ratio Points]]+CountyScoresTbl[[#This Row],[Serna Proposed Loans to Sales Ratio Points]],15)","v":6},0.6938509215462404,6,1.6038492381716118E-3,2,{"$f":"MIN(SUM(CountyScoresTbl[[#This Row],[Points Awarded10]],CountyScoresTbl[[#This Row],[Points Awarded12]]),15)","v":8},0.28152492668621704,2,5.1418439716312055E-2,2,{"$f":"MIN(SUM(CountyScoresTbl[[#This Row],[Points Awarded11]],CountyScoresTbl[[#This Row],[Points Awarded13]]),15)","v":4},1.5678879310344827,3,{"$f":"SUM(CountyScoresTbl[[#This Row],[Points Awarded5]],10)","v":13},0,{"$f":"IF(CountyScoresTbl[[#This Row],[OMS Migrant Family Housing Centers In County]]>=3,30,IF(CountyScoresTbl[[#This Row],[OMS Migrant Family Housing Centers In County]]=2,20,IF(CountyScoresTbl[[#This Row],[OMS Migrant Family Housing Centers In County]]=1,10,0)))","v":0}]
["Los Angeles",9.7373727087576381,4,0.64505698766751263,4,7.3513534571034239E-2,4,3.9887151154403083E-2,2,{"$f":"MIN(SUM(CountyScoresTbl[[#This Row],[Points Awarded]],CountyScoresTbl[[#This Row],[Points Awarded2]],CountyScoresTbl[[#This Row],[Points Awarded3]],CountyScoresTbl[[#This Row],[Points Awarded4]]),15)","v":14},null,null,4.3289269227572764E-2,4,null,null,0.35743533018959461,8,{"$f":"MIN(SUM(CountyScoresTbl[[#This Row],[Points Awarded6]],CountyScoresTbl[[#This Row],[Points Awarded7]],CountyScoresTbl[[#This Row],[Points Awarded8]],CountyScoresTbl[[#This Row],[Points Awarded9]]),15)","v":12},1.631578947368421,4,985000,1050000,873790.40010263503,{"$f":"MIN(\n500000,\nAVERAGE(CountyScoresTbl[[#This Row],[Redfin.com \nMedian Sales Price (October 2024)]:[Zillow.com Median Sales Price (October 2024)]]))","v":500000},7173,{"$f":"'HDPL Unit Mix'!$G$16","v":0},{"$f":"'HDPL Unit Mix'!$H$16","v":0},{"$f":"IFERROR(\nCountyScoresTbl[[#This Row],[Affordable Single Family Homes Sold In Last Year (November 2024)\n(Zillow.com)]]/CountyScoresTbl[[#This Row],[CalHome Proposed Number of Loans (entered by Applicant)]],\n0)","v":0},{"$f":"IFERROR(\nCountyScoresTbl[[#This Row],[Affordable Single Family Homes Sold In Last Year (November 2024)\n(Zillow.com)]]/CountyScoresTbl[[#This Row],[Serna Proposed Number of Loans (entered by Applicant)]],\n0)","v":0},{"$f":"IF(AC22>=167, 10,\nIF(AC22>=73, 8,\nIF(AC22>=34, 6,\nIF(AC22>=11, 4,\n0))))","v":0},{"$f":"IF(AD22>=167, 10,\nIF(AD22>=73, 8,\nIF(AD22>=34, 6,\nIF(AD22>=11, 4,\n2))))","v":2},{"$f":"MIN(CountyScoresTbl[[#This Row],[Median Owner Renter Cost Ratio Points]]+CountyScoresTbl[[#This Row],[CalHome Proposed Loans to Sales Ratio Points]],15)","v":4},{"$f":"MIN(CountyScoresTbl[[#This Row],[Median Owner Renter Cost Ratio Points]]+CountyScoresTbl[[#This Row],[Serna Proposed Loans to Sales Ratio Points]],15)","v":6},0.85796346262379486,8,1.6407599309153715E-2,8,{"$f":"MIN(SUM(CountyScoresTbl[[#This Row],[Points Awarded10]],CountyScoresTbl[[#This Row],[Points Awarded12]]),15)","v":15},0.42806425730529984,6,3.9887151154403083E-2,4,{"$f":"MIN(SUM(CountyScoresTbl[[#This Row],[Points Awarded11]],CountyScoresTbl[[#This Row],[Points Awarded13]]),15)","v":10},1.6857887874837028,2,{"$f":"SUM(CountyScoresTbl[[#This Row],[Points Awarded5]],10)","v":12},0,{"$f":"IF(CountyScoresTbl[[#This Row],[OMS Migrant Family Housing Centers In County]]>=3,30,IF(CountyScoresTbl[[#This Row],[OMS Migrant Family Housing Centers In County]]=2,20,IF(CountyScoresTbl[[#This Row],[OMS Migrant Family Housing Centers In County]]=1,10,0)))","v":0}]
["Madera",4.9829351535836182,2,0.63284696301323384,3,6.2436375975568371E-2,4,3.5351882160392797E-2,2,{"$f":"MIN(SUM(CountyScoresTbl[[#This Row],[Points Awarded]],CountyScoresTbl[[#This Row],[Points Awarded2]],CountyScoresTbl[[#This Row],[Points Awarded3]],CountyScoresTbl[[#This Row],[Points Awarded4]]),15)","v":11},null,null,6.8960845413900559E-2,8,null,null,0.29195561719833563,4,{"$f":"MIN(SUM(CountyScoresTbl[[#This Row],[Points Awarded6]],CountyScoresTbl[[#This Row],[Points Awarded7]],CountyScoresTbl[[#This Row],[Points Awarded8]],CountyScoresTbl[[#This Row],[Points Awarded9]]),15)","v":12},1.5974683544303798,4,432000,505000,409332.04817459098,{"$f":"MIN(\n500000,\nAVERAGE(CountyScoresTbl[[#This Row],[Redfin.com \nMedian Sales Price (October 2024)]:[Zillow.com Median Sales Price (October 2024)]]))","v":448777.34939153033},1195,{"$f":"'HDPL Unit Mix'!$G$16","v":0},{"$f":"'HDPL Unit Mix'!$H$16","v":0},{"$f":"IFERROR(\nCountyScoresTbl[[#This Row],[Affordable Single Family Homes Sold In Last Year (November 2024)\n(Zillow.com)]]/CountyScoresTbl[[#This Row],[CalHome Proposed Number of Loans (entered by Applicant)]],\n0)","v":0},{"$f":"IFERROR(\nCountyScoresTbl[[#This Row],[Affordable Single Family Homes Sold In Last Year (November 2024)\n(Zillow.com)]]/CountyScoresTbl[[#This Row],[Serna Proposed Number of Loans (entered by Applicant)]],\n0)","v":0},2,2,{"$f":"MIN(CountyScoresTbl[[#This Row],[Median Owner Renter Cost Ratio Points]]+CountyScoresTbl[[#This Row],[CalHome Proposed Loans to Sales Ratio Points]],15)","v":6},{"$f":"MIN(CountyScoresTbl[[#This Row],[Median Owner Renter Cost Ratio Points]]+CountyScoresTbl[[#This Row],[Serna Proposed Loans to Sales Ratio Points]],15)","v":6},0.49674431560987498,2,1.7857142857142856E-2,8,{"$f":"MIN(SUM(CountyScoresTbl[[#This Row],[Points Awarded10]],CountyScoresTbl[[#This Row],[Points Awarded12]]),15)","v":10},0.35067024128686325,2,3.5351882160392797E-2,4,{"$f":"MIN(SUM(CountyScoresTbl[[#This Row],[Points Awarded11]],CountyScoresTbl[[#This Row],[Points Awarded13]]),15)","v":6},1.4775280898876404,4,{"$f":"SUM(CountyScoresTbl[[#This Row],[Points Awarded5]],10)","v":14},1,{"$f":"IF(CountyScoresTbl[[#This Row],[OMS Migrant Family Housing Centers In County]]>=3,30,IF(CountyScoresTbl[[#This Row],[OMS Migrant Family Housing Centers In County]]=2,20,IF(CountyScoresTbl[[#This Row],[OMS Migrant Family Housing Centers In County]]=1,10,0)))","v":10}]
["Marin",9.110396570203644,4,0.6110077107152353,3,4.2143047061951606E-2,3,2.3370553103090108E-2,4,{"$f":"MIN(SUM(CountyScoresTbl[[#This Row],[Points Awarded]],CountyScoresTbl[[#This Row],[Points Awarded2]],CountyScoresTbl[[#This Row],[Points Awarded3]],CountyScoresTbl[[#This Row],[Points Awarded4]]),15)","v":14},null,null,1.9896429544835104E-2,2,null,null,0.32186862196689092,4,{"$f":"MIN(SUM(CountyScoresTbl[[#This Row],[Points Awarded6]],CountyScoresTbl[[#This Row],[Points Awarded7]],CountyScoresTbl[[#This Row],[Points Awarded8]],CountyScoresTbl[[#This Row],[Points Awarded9]]),15)","v":6},1.6087655810213108,4,1720000,1507225,1449890.88870315,{"$f":"MIN(\n500000,\nAVERAGE(CountyScoresTbl[[#This Row],[Redfin.com \nMedian Sales Price (October 2024)]:[Zillow.com Median Sales Price (October 2024)]]))","v":500000},218,{"$f":"'HDPL Unit Mix'!$G$16","v":0},{"$f":"'HDPL Unit Mix'!$H$16","v":0},{"$f":"IFERROR(\nCountyScoresTbl[[#This Row],[Affordable Single Family Homes Sold In Last Year (November 2024)\n(Zillow.com)]]/CountyScoresTbl[[#This Row],[CalHome Proposed Number of Loans (entered by Applicant)]],\n0)","v":0},{"$f":"IFERROR(\nCountyScoresTbl[[#This Row],[Affordable Single Family Homes Sold In Last Year (November 2024)\n(Zillow.com)]]/CountyScoresTbl[[#This Row],[Serna Proposed Number of Loans (entered by Applicant)]],\n0)","v":0},2,2,{"$f":"MIN(CountyScoresTbl[[#This Row],[Median Owner Renter Cost Ratio Points]]+CountyScoresTbl[[#This Row],[CalHome Proposed Loans to Sales Ratio Points]],15)","v":6},{"$f":"MIN(CountyScoresTbl[[#This Row],[Median Owner Renter Cost Ratio Points]]+CountyScoresTbl[[#This Row],[Serna Proposed Loans to Sales Ratio Points]],15)","v":6},0.87360785021973386,8,2.0409705949051326E-3,2,{"$f":"MIN(SUM(CountyScoresTbl[[#This Row],[Points Awarded10]],CountyScoresTbl[[#This Row],[Points Awarded12]]),15)","v":10},0.38577023498694518,4,2.3370553103090108E-2,8,{"$f":"MIN(SUM(CountyScoresTbl[[#This Row],[Points Awarded11]],CountyScoresTbl[[#This Row],[Points Awarded13]]),15)","v":12},1.7622119815668202,1,{"$f":"SUM(CountyScoresTbl[[#This Row],[Points Awarded5]],10)","v":11},0,{"$f":"IF(CountyScoresTbl[[#This Row],[OMS Migrant Family Housing Centers In County]]>=3,30,IF(CountyScoresTbl[[#This Row],[OMS Migrant Family Housing Centers In County]]=2,20,IF(CountyScoresTbl[[#This Row],[OMS Migrant Family Housing Centers In County]]=1,10,0)))","v":0}]
["Mariposa",5.2901023890784984,2,0.66203703703703709,4,6.9444444444444441E-3,1,0.10559006211180125,1,{"$f":"MIN(SUM(CountyScoresTbl[[#This Row],[Points Awarded]],CountyScoresTbl[[#This Row],[Points Awarded2]],CountyScoresTbl[[#This Row],[Points Awarded3]],CountyScoresTbl[[#This Row],[Points Awarded4]]),15)","v":8},null,null,3.4680424190312413E-2,4,null,null,0.35543278084714547,8,{"$f":"MIN(SUM(CountyScoresTbl[[#This Row],[Points Awarded6]],CountyScoresTbl[[#This Row],[Points Awarded7]],CountyScoresTbl[[#This Row],[Points Awarded8]],CountyScoresTbl[[#This Row],[Points Awarded9]]),15)","v":12},1.7213403880070546,2,432000,499975,389195.67679860198,{"$f":"MIN(\n500000,\nAVERAGE(CountyScoresTbl[[#This Row],[Redfin.com \nMedian Sales Price (October 2024)]:[Zillow.com Median Sales Price (October 2024)]]))","v":440390.22559953405},220,{"$f":"'HDPL Unit Mix'!$G$16","v":0},{"$f":"'HDPL Unit Mix'!$H$16","v":0},{"$f":"IFERROR(\nCountyScoresTbl[[#This Row],[Affordable Single Family Homes Sold In Last Year (November 2024)\n(Zillow.com)]]/CountyScoresTbl[[#This Row],[CalHome Proposed Number of Loans (entered by Applicant)]],\n0)","v":0},{"$f":"IFERROR(\nCountyScoresTbl[[#This Row],[Affordable Single Family Homes Sold In Last Year (November 2024)\n(Zillow.com)]]/CountyScoresTbl[[#This Row],[Serna Proposed Number of Loans (entered by Applicant)]],\n0)","v":0},2,2,{"$f":"MIN(CountyScoresTbl[[#This Row],[Median Owner Renter Cost Ratio Points]]+CountyScoresTbl[[#This Row],[CalHome Proposed Loans to Sales Ratio Points]],15)","v":4},{"$f":"MIN(CountyScoresTbl[[#This Row],[Median Owner Renter Cost Ratio Points]]+CountyScoresTbl[[#This Row],[Serna Proposed Loans to Sales Ratio Points]],15)","v":4},0.63097787294789431,4,2.7624309392265192E-3,2,{"$f":"MIN(SUM(CountyScoresTbl[[#This Row],[Points Awarded10]],CountyScoresTbl[[#This Row],[Points Awarded12]]),15)","v":6},0.36713286713286714,4,0.10559006211180125,2,{"$f":"MIN(SUM(CountyScoresTbl[[#This Row],[Points Awarded11]],CountyScoresTbl[[#This Row],[Points Awarded13]]),15)","v":6},1.6861386138613861,2,{"$f":"SUM(CountyScoresTbl[[#This Row],[Points Awarded5]],10)","v":12},0,{"$f":"IF(CountyScoresTbl[[#This Row],[OMS Migrant Family Housing Centers In County]]>=3,30,IF(CountyScoresTbl[[#This Row],[OMS Migrant Family Housing Centers In County]]=2,20,IF(CountyScoresTbl[[#This Row],[OMS Migrant Family Housing Centers In County]]=1,10,0)))","v":0}]
["Mendocino",5.7079646017699117,3,0.61745213549337263,3,2.7614138438880706E-2,2,2.3372887450557354E-2,4,{"$f":"MIN(SUM(CountyScoresTbl[[#This Row],[Points Awarded]],CountyScoresTbl[[#This Row],[Points Awarded2]],CountyScoresTbl[[#This Row],[Points Awarded3]],CountyScoresTbl[[#This Row],[Points Awarded4]]),15)","v":12},null,null,5.7527990571596938E-2,6,null,null,0.33681145353069641,6,{"$f":"MIN(SUM(CountyScoresTbl[[#This Row],[Points Awarded6]],CountyScoresTbl[[#This Row],[Points Awarded7]],CountyScoresTbl[[#This Row],[Points Awarded8]],CountyScoresTbl[[#This Row],[Points Awarded9]]),15)","v":12},1.7854838709677419,2,525000,679250,493022.98600432702,{"$f":"MIN(\n500000,\nAVERAGE(CountyScoresTbl[[#This Row],[Redfin.com \nMedian Sales Price (October 2024)]:[Zillow.com Median Sales Price (October 2024)]]))","v":500000},529,{"$f":"'HDPL Unit Mix'!$G$16","v":0},{"$f":"'HDPL Unit Mix'!$H$16","v":0},{"$f":"IFERROR(\nCountyScoresTbl[[#This Row],[Affordable Single Family Homes Sold In Last Year (November 2024)\n(Zillow.com)]]/CountyScoresTbl[[#This Row],[CalHome Proposed Number of Loans (entered by Applicant)]],\n0)","v":0},{"$f":"IFERROR(\nCountyScoresTbl[[#This Row],[Affordable Single Family Homes Sold In Last Year (November 2024)\n(Zillow.com)]]/CountyScoresTbl[[#This Row],[Serna Proposed Number of Loans (entered by Applicant)]],\n0)","v":0},2,2,{"$f":"MIN(CountyScoresTbl[[#This Row],[Median Owner Renter Cost Ratio Points]]+CountyScoresTbl[[#This Row],[CalHome Proposed Loans to Sales Ratio Points]],15)","v":4},{"$f":"MIN(CountyScoresTbl[[#This Row],[Median Owner Renter Cost Ratio Points]]+CountyScoresTbl[[#This Row],[Serna Proposed Loans to Sales Ratio Points]],15)","v":4},0.72913894696825698,6,7.7651055569036643E-3,4,{"$f":"MIN(SUM(CountyScoresTbl[[#This Row],[Points Awarded10]],CountyScoresTbl[[#This Row],[Points Awarded12]]),15)","v":10},0.36553369111508649,4,2.3372887450557354E-2,8,{"$f":"MIN(SUM(CountyScoresTbl[[#This Row],[Points Awarded11]],CountyScoresTbl[[#This Row],[Points Awarded13]]),15)","v":12},1.7204585537918871,2,{"$f":"SUM(CountyScoresTbl[[#This Row],[Points Awarded5]],10)","v":12},0,{"$f":"IF(CountyScoresTbl[[#This Row],[OMS Migrant Family Housing Centers In County]]>=3,30,IF(CountyScoresTbl[[#This Row],[OMS Migrant Family Housing Centers In County]]=2,20,IF(CountyScoresTbl[[#This Row],[OMS Migrant Family Housing Centers In County]]=1,10,0)))","v":0}]
["Merced",4.6871444823663255,2,0.56967316949581959,2,3.445654927793261E-2,3,3.1886190826588175E-2,3,{"$f":"MIN(SUM(CountyScoresTbl[[#This Row],[Points Awarded]],CountyScoresTbl[[#This Row],[Points Awarded2]],CountyScoresTbl[[#This Row],[Points Awarded3]],CountyScoresTbl[[#This Row],[Points Awarded4]]),15)","v":10},null,null,7.6493799323562567E-2,8,null,null,0.32411911258749554,6,{"$f":"MIN(SUM(CountyScoresTbl[[#This Row],[Points Awarded6]],CountyScoresTbl[[#This Row],[Points Awarded7]],CountyScoresTbl[[#This Row],[Points Awarded8]],CountyScoresTbl[[#This Row],[Points Awarded9]]),15)","v":14},1.4758333333333333,6,420000,468995,411848.95743971801,{"$f":"MIN(\n500000,\nAVERAGE(CountyScoresTbl[[#This Row],[Redfin.com \nMedian Sales Price (October 2024)]:[Zillow.com Median Sales Price (October 2024)]]))","v":433614.65247990604},1281,{"$f":"'HDPL Unit Mix'!$G$16","v":0},{"$f":"'HDPL Unit Mix'!$H$16","v":0},{"$f":"IFERROR(\nCountyScoresTbl[[#This Row],[Affordable Single Family Homes Sold In Last Year (November 2024)\n(Zillow.com)]]/CountyScoresTbl[[#This Row],[CalHome Proposed Number of Loans (entered by Applicant)]],\n0)","v":0},{"$f":"IFERROR(\nCountyScoresTbl[[#This Row],[Affordable Single Family Homes Sold In Last Year (November 2024)\n(Zillow.com)]]/CountyScoresTbl[[#This Row],[Serna Proposed Number of Loans (entered by Applicant)]],\n0)","v":0},2,2,{"$f":"MIN(CountyScoresTbl[[#This Row],[Median Owner Renter Cost Ratio Points]]+CountyScoresTbl[[#This Row],[CalHome Proposed Loans to Sales Ratio Points]],15)","v":8},{"$f":"MIN(CountyScoresTbl[[#This Row],[Median Owner Renter Cost Ratio Points]]+CountyScoresTbl[[#This Row],[Serna Proposed Loans to Sales Ratio Points]],15)","v":8},0.53664281184889939,2,1.3050183888954799E-2,8,{"$f":"MIN(SUM(CountyScoresTbl[[#This Row],[Points Awarded10]],CountyScoresTbl[[#This Row],[Points Awarded12]]),15)","v":10},0.35823882588392264,4,3.1886190826588175E-2,6,{"$f":"MIN(SUM(CountyScoresTbl[[#This Row],[Points Awarded11]],CountyScoresTbl[[#This Row],[Points Awarded13]]),15)","v":10},1.4573055028462998,5,{"$f":"SUM(CountyScoresTbl[[#This Row],[Points Awarded5]],10)","v":15},4,{"$f":"IF(CountyScoresTbl[[#This Row],[OMS Migrant Family Housing Centers In County]]>=3,30,IF(CountyScoresTbl[[#This Row],[OMS Migrant Family Housing Centers In County]]=2,20,IF(CountyScoresTbl[[#This Row],[OMS Migrant Family Housing Centers In County]]=1,10,0)))","v":30}]
["Modoc",15,4,0.66091954022988508,4,0,1,0,4,{"$f":"MIN(SUM(CountyScoresTbl[[#This Row],[Points Awarded]],CountyScoresTbl[[#This Row],[Points Awarded2]],CountyScoresTbl[[#This Row],[Points Awarded3]],CountyScoresTbl[[#This Row],[Points Awarded4]]),15)","v":13},null,null,6.0383747178329568E-2,8,null,null,0.40667976424361491,8,{"$f":"MIN(SUM(CountyScoresTbl[[#This Row],[Points Awarded6]],CountyScoresTbl[[#This Row],[Points Awarded7]],CountyScoresTbl[[#This Row],[Points Awarded8]],CountyScoresTbl[[#This Row],[Points Awarded9]]),15)","v":15},1.5716080402010051,4,100000,249750,190117.44709081599,{"$f":"MIN(\n500000,\nAVERAGE(CountyScoresTbl[[#This Row],[Redfin.com \nMedian Sales Price (October 2024)]:[Zillow.com Median Sales Price (October 2024)]]))","v":179955.81569693866},61,{"$f":"'HDPL Unit Mix'!$G$16","v":0},{"$f":"'HDPL Unit Mix'!$H$16","v":0},{"$f":"IFERROR(\nCountyScoresTbl[[#This Row],[Affordable Single Family Homes Sold In Last Year (November 2024)\n(Zillow.com)]]/CountyScoresTbl[[#This Row],[CalHome Proposed Number of Loans (entered by Applicant)]],\n0)","v":0},{"$f":"IFERROR(\nCountyScoresTbl[[#This Row],[Affordable Single Family Homes Sold In Last Year (November 2024)\n(Zillow.com)]]/CountyScoresTbl[[#This Row],[Serna Proposed Number of Loans (entered by Applicant)]],\n0)","v":0},2,2,{"$f":"MIN(CountyScoresTbl[[#This Row],[Median Owner Renter Cost Ratio Points]]+CountyScoresTbl[[#This Row],[CalHome Proposed Loans to Sales Ratio Points]],15)","v":6},{"$f":"MIN(CountyScoresTbl[[#This Row],[Median Owner Renter Cost Ratio Points]]+CountyScoresTbl[[#This Row],[Serna Proposed Loans to Sales Ratio Points]],15)","v":6},0.70707860774344933,6,3.929273084479371E-3,2,{"$f":"MIN(SUM(CountyScoresTbl[[#This Row],[Points Awarded10]],CountyScoresTbl[[#This Row],[Points Awarded12]]),15)","v":8},0.31304347826086959,2,0,8,{"$f":"MIN(SUM(CountyScoresTbl[[#This Row],[Points Awarded11]],CountyScoresTbl[[#This Row],[Points Awarded13]]),15)","v":10},1.5548216644649935,3,{"$f":"SUM(CountyScoresTbl[[#This Row],[Points Awarded5]],10)","v":13},1,{"$f":"IF(CountyScoresTbl[[#This Row],[OMS Migrant Family Housing Centers In County]]>=3,30,IF(CountyScoresTbl[[#This Row],[OMS Migrant Family Housing Centers In County]]=2,20,IF(CountyScoresTbl[[#This Row],[OMS Migrant Family Housing Centers In County]]=1,10,0)))","v":10}]
["Mono",9.1595845136921632,4,0.33242506811989103,1,0,1,0.25708502024291496,1,{"$f":"MIN(SUM(CountyScoresTbl[[#This Row],[Points Awarded]],CountyScoresTbl[[#This Row],[Points Awarded2]],CountyScoresTbl[[#This Row],[Points Awarded3]],CountyScoresTbl[[#This Row],[Points Awarded4]]),15)","v":7},null,null,6.6787658802177852E-2,8,null,null,0.19574468085106383,2,{"$f":"MIN(SUM(CountyScoresTbl[[#This Row],[Points Awarded6]],CountyScoresTbl[[#This Row],[Points Awarded7]],CountyScoresTbl[[#This Row],[Points Awarded8]],CountyScoresTbl[[#This Row],[Points Awarded9]]),15)","v":10},1.9324861000794282,2,867000,833250,737583.60419733298,{"$f":"MIN(\n500000,\nAVERAGE(CountyScoresTbl[[#This Row],[Redfin.com \nMedian Sales Price (October 2024)]:[Zillow.com Median Sales Price (October 2024)]]))","v":500000},114,{"$f":"'HDPL Unit Mix'!$G$16","v":0},{"$f":"'HDPL Unit Mix'!$H$16","v":0},{"$f":"IFERROR(\nCountyScoresTbl[[#This Row],[Affordable Single Family Homes Sold In Last Year (November 2024)\n(Zillow.com)]]/CountyScoresTbl[[#This Row],[CalHome Proposed Number of Loans (entered by Applicant)]],\n0)","v":0},{"$f":"IFERROR(\nCountyScoresTbl[[#This Row],[Affordable Single Family Homes Sold In Last Year (November 2024)\n(Zillow.com)]]/CountyScoresTbl[[#This Row],[Serna Proposed Number of Loans (entered by Applicant)]],\n0)","v":0},2,2,{"$f":"MIN(CountyScoresTbl[[#This Row],[Median Owner Renter Cost Ratio Points]]+CountyScoresTbl[[#This Row],[CalHome Proposed Loans to Sales Ratio Points]],15)","v":4},{"$f":"MIN(CountyScoresTbl[[#This Row],[Median Owner Renter Cost Ratio Points]]+CountyScoresTbl[[#This Row],[Serna Proposed Loans to Sales Ratio Points]],15)","v":4},0.7280256478760353,6,0,2,{"$f":"MIN(SUM(CountyScoresTbl[[#This Row],[Points Awarded10]],CountyScoresTbl[[#This Row],[Points Awarded12]]),15)","v":8},0.13114754098360656,2,0.25708502024291496,2,{"$f":"MIN(SUM(CountyScoresTbl[[#This Row],[Points Awarded11]],CountyScoresTbl[[#This Row],[Points Awarded13]]),15)","v":4},1.6306089743589745,2,{"$f":"SUM(CountyScoresTbl[[#This Row],[Points Awarded5]],10)","v":12},0,{"$f":"IF(CountyScoresTbl[[#This Row],[OMS Migrant Family Housing Centers In County]]>=3,30,IF(CountyScoresTbl[[#This Row],[OMS Migrant Family Housing Centers In County]]=2,20,IF(CountyScoresTbl[[#This Row],[OMS Migrant Family Housing Centers In County]]=1,10,0)))","v":0}]
["Monterey",8.913178294573644,4,0.59646468667887576,2,7.5802213552034398E-2,4,3.2210834553440704E-2,3,{"$f":"MIN(SUM(CountyScoresTbl[[#This Row],[Points Awarded]],CountyScoresTbl[[#This Row],[Points Awarded2]],CountyScoresTbl[[#This Row],[Points Awarded3]],CountyScoresTbl[[#This Row],[Points Awarded4]]),15)","v":13},null,null,3.9562273597966886E-2,4,null,null,0.30410836558499554,4,{"$f":"MIN(SUM(CountyScoresTbl[[#This Row],[Points Awarded6]],CountyScoresTbl[[#This Row],[Points Awarded7]],CountyScoresTbl[[#This Row],[Points Awarded8]],CountyScoresTbl[[#This Row],[Points Awarded9]]),15)","v":8},1.4207154297917779,8,892500,1298250,828448.305015811,{"$f":"MIN(\n500000,\nAVERAGE(CountyScoresTbl[[#This Row],[Redfin.com \nMedian Sales Price (October 2024)]:[Zillow.com Median Sales Price (October 2024)]]))","v":500000},395,{"$f":"'HDPL Unit Mix'!$G$16","v":0},{"$f":"'HDPL Unit Mix'!$H$16","v":0},{"$f":"IFERROR(\nCountyScoresTbl[[#This Row],[Affordable Single Family Homes Sold In Last Year (November 2024)\n(Zillow.com)]]/CountyScoresTbl[[#This Row],[CalHome Proposed Number of Loans (entered by Applicant)]],\n0)","v":0},{"$f":"IFERROR(\nCountyScoresTbl[[#This Row],[Affordable Single Family Homes Sold In Last Year (November 2024)\n(Zillow.com)]]/CountyScoresTbl[[#This Row],[Serna Proposed Number of Loans (entered by Applicant)]],\n0)","v":0},2,2,{"$f":"MIN(CountyScoresTbl[[#This Row],[Median Owner Renter Cost Ratio Points]]+CountyScoresTbl[[#This Row],[CalHome Proposed Loans to Sales Ratio Points]],15)","v":10},{"$f":"MIN(CountyScoresTbl[[#This Row],[Median Owner Renter Cost Ratio Points]]+CountyScoresTbl[[#This Row],[Serna Proposed Loans to Sales Ratio Points]],15)","v":10},0.73824953554030925,6,1.6969336111938078E-2,8,{"$f":"MIN(SUM(CountyScoresTbl[[#This Row],[Points Awarded10]],CountyScoresTbl[[#This Row],[Points Awarded12]]),15)","v":14},0.39300493926044588,6,3.2210834553440704E-2,6,{"$f":"MIN(SUM(CountyScoresTbl[[#This Row],[Points Awarded11]],CountyScoresTbl[[#This Row],[Points Awarded13]]),15)","v":12},1.47,5,{"$f":"SUM(CountyScoresTbl[[#This Row],[Points Awarded5]],10)","v":15},1,{"$f":"IF(CountyScoresTbl[[#This Row],[OMS Migrant Family Housing Centers In County]]>=3,30,IF(CountyScoresTbl[[#This Row],[OMS Migrant Family Housing Centers In County]]=2,20,IF(CountyScoresTbl[[#This Row],[OMS Migrant Family Housing Centers In County]]=1,10,0)))","v":10}]
["Napa",7.0216049382716053,3,0.58643260934245756,2,3.0645641178220769E-2,3,4.5712663259511642E-2,1,{"$f":"MIN(SUM(CountyScoresTbl[[#This Row],[Points Awarded]],CountyScoresTbl[[#This Row],[Points Awarded2]],CountyScoresTbl[[#This Row],[Points Awarded3]],CountyScoresTbl[[#This Row],[Points Awarded4]]),15)","v":9},null,null,3.3846288745670569E-2,4,null,null,0.32576706324358173,6,{"$f":"MIN(SUM(CountyScoresTbl[[#This Row],[Points Awarded6]],CountyScoresTbl[[#This Row],[Points Awarded7]],CountyScoresTbl[[#This Row],[Points Awarded8]],CountyScoresTbl[[#This Row],[Points Awarded9]]),15)","v":10},1.5257731958762886,4,865000,1506000,897716.417917741,{"$f":"MIN(\n500000,\nAVERAGE(CountyScoresTbl[[#This Row],[Redfin.com \nMedian Sales Price (October 2024)]:[Zillow.com Median Sales Price (October 2024)]]))","v":500000},236,{"$f":"'HDPL Unit Mix'!$G$16","v":0},{"$f":"'HDPL Unit Mix'!$H$16","v":0},{"$f":"IFERROR(\nCountyScoresTbl[[#This Row],[Affordable Single Family Homes Sold In Last Year (November 2024)\n(Zillow.com)]]/CountyScoresTbl[[#This Row],[CalHome Proposed Number of Loans (entered by Applicant)]],\n0)","v":0},{"$f":"IFERROR(\nCountyScoresTbl[[#This Row],[Affordable Single Family Homes Sold In Last Year (November 2024)\n(Zillow.com)]]/CountyScoresTbl[[#This Row],[Serna Proposed Number of Loans (entered by Applicant)]],\n0)","v":0},2,2,{"$f":"MIN(CountyScoresTbl[[#This Row],[Median Owner Renter Cost Ratio Points]]+CountyScoresTbl[[#This Row],[CalHome Proposed Loans to Sales Ratio Points]],15)","v":6},{"$f":"MIN(CountyScoresTbl[[#This Row],[Median Owner Renter Cost Ratio Points]]+CountyScoresTbl[[#This Row],[Serna Proposed Loans to Sales Ratio Points]],15)","v":6},0.73980546202768427,8,7.8271759549154666E-3,6,{"$f":"MIN(SUM(CountyScoresTbl[[#This Row],[Points Awarded10]],CountyScoresTbl[[#This Row],[Points Awarded12]]),15)","v":14},0.39878234398782342,6,4.5712663259511642E-2,2,{"$f":"MIN(SUM(CountyScoresTbl[[#This Row],[Points Awarded11]],CountyScoresTbl[[#This Row],[Points Awarded13]]),15)","v":8},1.5273239436619719,3,{"$f":"SUM(CountyScoresTbl[[#This Row],[Points Awarded5]],10)","v":13},0,{"$f":"IF(CountyScoresTbl[[#This Row],[OMS Migrant Family Housing Centers In County]]>=3,30,IF(CountyScoresTbl[[#This Row],[OMS Migrant Family Housing Centers In County]]=2,20,IF(CountyScoresTbl[[#This Row],[OMS Migrant Family Housing Centers In County]]=1,10,0)))","v":0}]
["Nevada",4.6888888888888891,2,0.64846077457795437,4,2.1847070506454815E-2,2,4.5045045045045043E-2,2,{"$f":"MIN(SUM(CountyScoresTbl[[#This Row],[Points Awarded]],CountyScoresTbl[[#This Row],[Points Awarded2]],CountyScoresTbl[[#This Row],[Points Awarded3]],CountyScoresTbl[[#This Row],[Points Awarded4]]),15)","v":10},null,null,4.4152965084056903E-2,6,null,null,0.34377536114267165,8,{"$f":"MIN(SUM(CountyScoresTbl[[#This Row],[Points Awarded6]],CountyScoresTbl[[#This Row],[Points Awarded7]],CountyScoresTbl[[#This Row],[Points Awarded8]],CountyScoresTbl[[#This Row],[Points Awarded9]]),15)","v":14},1.7215870880968394,2,610000,672450,620006.413740032,{"$f":"MIN(\n500000,\nAVERAGE(CountyScoresTbl[[#This Row],[Redfin.com \nMedian Sales Price (October 2024)]:[Zillow.com Median Sales Price (October 2024)]]))","v":500000},783,{"$f":"'HDPL Unit Mix'!$G$16","v":0},{"$f":"'HDPL Unit Mix'!$H$16","v":0},{"$f":"IFERROR(\nCountyScoresTbl[[#This Row],[Affordable Single Family Homes Sold In Last Year (November 2024)\n(Zillow.com)]]/CountyScoresTbl[[#This Row],[CalHome Proposed Number of Loans (entered by Applicant)]],\n0)","v":0},{"$f":"IFERROR(\nCountyScoresTbl[[#This Row],[Affordable Single Family Homes Sold In Last Year (November 2024)\n(Zillow.com)]]/CountyScoresTbl[[#This Row],[Serna Proposed Number of Loans (entered by Applicant)]],\n0)","v":0},2,2,{"$f":"MIN(CountyScoresTbl[[#This Row],[Median Owner Renter Cost Ratio Points]]+CountyScoresTbl[[#This Row],[CalHome Proposed Loans to Sales Ratio Points]],15)","v":4},{"$f":"MIN(CountyScoresTbl[[#This Row],[Median Owner Renter Cost Ratio Points]]+CountyScoresTbl[[#This Row],[Serna Proposed Loans to Sales Ratio Points]],15)","v":4},0.64738709677419359,4,4.7070280798571663E-3,4,{"$f":"MIN(SUM(CountyScoresTbl[[#This Row],[Points Awarded10]],CountyScoresTbl[[#This Row],[Points Awarded12]]),15)","v":8},0.47932618683001532,8,4.5045045045045043E-2,4,{"$f":"MIN(SUM(CountyScoresTbl[[#This Row],[Points Awarded11]],CountyScoresTbl[[#This Row],[Points Awarded13]]),15)","v":12},1.6577946768060836,2,{"$f":"SUM(CountyScoresTbl[[#This Row],[Points Awarded5]],10)","v":12},0,{"$f":"IF(CountyScoresTbl[[#This Row],[OMS Migrant Family Housing Centers In County]]>=3,30,IF(CountyScoresTbl[[#This Row],[OMS Migrant Family Housing Centers In County]]=2,20,IF(CountyScoresTbl[[#This Row],[OMS Migrant Family Housing Centers In County]]=1,10,0)))","v":0}]
["Orange",10.465116279069768,4,0.60314182137756789,3,5.9859387015269688E-2,4,4.0941464031354041E-2,2,{"$f":"MIN(SUM(CountyScoresTbl[[#This Row],[Points Awarded]],CountyScoresTbl[[#This Row],[Points Awarded2]],CountyScoresTbl[[#This Row],[Points Awarded3]],CountyScoresTbl[[#This Row],[Points Awarded4]]),15)","v":13},null,null,3.4295512388853151E-2,4,null,null,0.32617356085253302,6,{"$f":"MIN(SUM(CountyScoresTbl[[#This Row],[Points Awarded6]],CountyScoresTbl[[#This Row],[Points Awarded7]],CountyScoresTbl[[#This Row],[Points Awarded8]],CountyScoresTbl[[#This Row],[Points Awarded9]]),15)","v":10},1.4306049822064058,8,1325000,1397000,1143639.58169648,{"$f":"MIN(\n500000,\nAVERAGE(CountyScoresTbl[[#This Row],[Redfin.com \nMedian Sales Price (October 2024)]:[Zillow.com Median Sales Price (October 2024)]]))","v":500000},2693,{"$f":"'HDPL Unit Mix'!$G$16","v":0},{"$f":"'HDPL Unit Mix'!$H$16","v":0},{"$f":"IFERROR(\nCountyScoresTbl[[#This Row],[Affordable Single Family Homes Sold In Last Year (November 2024)\n(Zillow.com)]]/CountyScoresTbl[[#This Row],[CalHome Proposed Number of Loans (entered by Applicant)]],\n0)","v":0},{"$f":"IFERROR(\nCountyScoresTbl[[#This Row],[Affordable Single Family Homes Sold In Last Year (November 2024)\n(Zillow.com)]]/CountyScoresTbl[[#This Row],[Serna Proposed Number of Loans (entered by Applicant)]],\n0)","v":0},2,2,{"$f":"MIN(CountyScoresTbl[[#This Row],[Median Owner Renter Cost Ratio Points]]+CountyScoresTbl[[#This Row],[CalHome Proposed Loans to Sales Ratio Points]],15)","v":10},{"$f":"MIN(CountyScoresTbl[[#This Row],[Median Owner Renter Cost Ratio Points]]+CountyScoresTbl[[#This Row],[Serna Proposed Loans to Sales Ratio Points]],15)","v":10},0.74838753547090264,8,1.0382776708053914E-2,6,{"$f":"MIN(SUM(CountyScoresTbl[[#This Row],[Points Awarded10]],CountyScoresTbl[[#This Row],[Points Awarded12]]),15)","v":14},0.43668949439020838,8,4.0941464031354041E-2,4,{"$f":"MIN(SUM(CountyScoresTbl[[#This Row],[Points Awarded11]],CountyScoresTbl[[#This Row],[Points Awarded13]]),15)","v":12},1.4714730290456433,5,{"$f":"SUM(CountyScoresTbl[[#This Row],[Points Awarded5]],10)","v":15},0,{"$f":"IF(CountyScoresTbl[[#This Row],[OMS Migrant Family Housing Centers In County]]>=3,30,IF(CountyScoresTbl[[#This Row],[OMS Migrant Family Housing Centers In County]]=2,20,IF(CountyScoresTbl[[#This Row],[OMS Migrant Family Housing Centers In County]]=1,10,0)))","v":0}]
["Placer",5.6997366110623355,3,0.50426492724535876,1,1.9568489713998997E-2,2,3.3462657613967023E-2,3,{"$f":"MIN(SUM(CountyScoresTbl[[#This Row],[Points Awarded]],CountyScoresTbl[[#This Row],[Points Awarded2]],CountyScoresTbl[[#This Row],[Points Awarded3]],CountyScoresTbl[[#This Row],[Points Awarded4]]),15)","v":9},null,null,2.7801218940459446E-2,2,null,null,0.23835965591006328,2,{"$f":"MIN(SUM(CountyScoresTbl[[#This Row],[Points Awarded6]],CountyScoresTbl[[#This Row],[Points Awarded7]],CountyScoresTbl[[#This Row],[Points Awarded8]],CountyScoresTbl[[#This Row],[Points Awarded9]]),15)","v":4},1.496264674493063,6,660000,737000,680893.00883632305,{"$f":"MIN(\n500000,\nAVERAGE(CountyScoresTbl[[#This Row],[Redfin.com \nMedian Sales Price (October 2024)]:[Zillow.com Median Sales Price (October 2024)]]))","v":500000},1220,{"$f":"'HDPL Unit Mix'!$G$16","v":0},{"$f":"'HDPL Unit Mix'!$H$16","v":0},{"$f":"IFERROR(\nCountyScoresTbl[[#This Row],[Affordable Single Family Homes Sold In Last Year (November 2024)\n(Zillow.com)]]/CountyScoresTbl[[#This Row],[CalHome Proposed Number of Loans (entered by Applicant)]],\n0)","v":0},{"$f":"IFERROR(\nCountyScoresTbl[[#This Row],[Affordable Single Family Homes Sold In Last Year (November 2024)\n(Zillow.com)]]/CountyScoresTbl[[#This Row],[Serna Proposed Number of Loans (entered by Applicant)]],\n0)","v":0},2,2,{"$f":"MIN(CountyScoresTbl[[#This Row],[Median Owner Renter Cost Ratio Points]]+CountyScoresTbl[[#This Row],[CalHome Proposed Loans to Sales Ratio Points]],15)","v":8},{"$f":"MIN(CountyScoresTbl[[#This Row],[Median Owner Renter Cost Ratio Points]]+CountyScoresTbl[[#This Row],[Serna Proposed Loans to Sales Ratio Points]],15)","v":8},0.39320763430642025,2,2.0481543853261117E-3,2,{"$f":"MIN(SUM(CountyScoresTbl[[#This Row],[Points Awarded10]],CountyScoresTbl[[#This Row],[Points Awarded12]]),15)","v":4},0.44179104477611941,8,3.3462657613967023E-2,6,{"$f":"MIN(SUM(CountyScoresTbl[[#This Row],[Points Awarded11]],CountyScoresTbl[[#This Row],[Points Awarded13]]),15)","v":14},1.5235148514851484,4,{"$f":"SUM(CountyScoresTbl[[#This Row],[Points Awarded5]],10)","v":14},0,{"$f":"IF(CountyScoresTbl[[#This Row],[OMS Migrant Family Housing Centers In County]]>=3,30,IF(CountyScoresTbl[[#This Row],[OMS Migrant Family Housing Centers In County]]=2,20,IF(CountyScoresTbl[[#This Row],[OMS Migrant Family Housing Centers In County]]=1,10,0)))","v":0}]
["Plumas",4.0854978354978355,1,0.59210526315789469,2,1.9736842105263157E-2,2,3.7974683544303799E-2,2,{"$f":"MIN(SUM(CountyScoresTbl[[#This Row],[Points Awarded]],CountyScoresTbl[[#This Row],[Points Awarded2]],CountyScoresTbl[[#This Row],[Points Awarded3]],CountyScoresTbl[[#This Row],[Points Awarded4]]),15)","v":7},null,null,2.2428083861530959E-2,2,null,null,0.35546218487394959,8,{"$f":"MIN(SUM(CountyScoresTbl[[#This Row],[Points Awarded6]],CountyScoresTbl[[#This Row],[Points Awarded7]],CountyScoresTbl[[#This Row],[Points Awarded8]],CountyScoresTbl[[#This Row],[Points Awarded9]]),15)","v":10},1.574410163339383,4,366500,492000,381948.16571762803,{"$f":"MIN(\n500000,\nAVERAGE(CountyScoresTbl[[#This Row],[Redfin.com \nMedian Sales Price (October 2024)]:[Zillow.com Median Sales Price (October 2024)]]))","v":413482.72190587601},409,{"$f":"'HDPL Unit Mix'!$G$16","v":0},{"$f":"'HDPL Unit Mix'!$H$16","v":0},{"$f":"IFERROR(\nCountyScoresTbl[[#This Row],[Affordable Single Family Homes Sold In Last Year (November 2024)\n(Zillow.com)]]/CountyScoresTbl[[#This Row],[CalHome Proposed Number of Loans (entered by Applicant)]],\n0)","v":0},{"$f":"IFERROR(\nCountyScoresTbl[[#This Row],[Affordable Single Family Homes Sold In Last Year (November 2024)\n(Zillow.com)]]/CountyScoresTbl[[#This Row],[Serna Proposed Number of Loans (entered by Applicant)]],\n0)","v":0},2,2,{"$f":"MIN(CountyScoresTbl[[#This Row],[Median Owner Renter Cost Ratio Points]]+CountyScoresTbl[[#This Row],[CalHome Proposed Loans to Sales Ratio Points]],15)","v":6},{"$f":"MIN(CountyScoresTbl[[#This Row],[Median Owner Renter Cost Ratio Points]]+CountyScoresTbl[[#This Row],[Serna Proposed Loans to Sales Ratio Points]],15)","v":6},0.63655985389340863,4,0,2,{"$f":"MIN(SUM(CountyScoresTbl[[#This Row],[Points Awarded10]],CountyScoresTbl[[#This Row],[Points Awarded12]]),15)","v":6},0.35555555555555557,4,3.7974683544303799E-2,4,{"$f":"MIN(SUM(CountyScoresTbl[[#This Row],[Points Awarded11]],CountyScoresTbl[[#This Row],[Points Awarded13]]),15)","v":8},1.6949152542372881,2,{"$f":"SUM(CountyScoresTbl[[#This Row],[Points Awarded5]],10)","v":12},0,{"$f":"IF(CountyScoresTbl[[#This Row],[OMS Migrant Family Housing Centers In County]]>=3,30,IF(CountyScoresTbl[[#This Row],[OMS Migrant Family Housing Centers In County]]=2,20,IF(CountyScoresTbl[[#This Row],[OMS Migrant Family Housing Centers In County]]=1,10,0)))","v":0}]
["Riverside",6.5128205128205128,3,0.56417480458406588,2,4.0862583938822632E-2,3,4.6708400646203553E-2,1,{"$f":"MIN(SUM(CountyScoresTbl[[#This Row],[Points Awarded]],CountyScoresTbl[[#This Row],[Points Awarded2]],CountyScoresTbl[[#This Row],[Points Awarded3]],CountyScoresTbl[[#This Row],[Points Awarded4]]),15)","v":9},null,null,5.1858677114312322E-2,6,null,null,0.30668820742561498,4,{"$f":"MIN(SUM(CountyScoresTbl[[#This Row],[Points Awarded6]],CountyScoresTbl[[#This Row],[Points Awarded7]],CountyScoresTbl[[#This Row],[Points Awarded8]],CountyScoresTbl[[#This Row],[Points Awarded9]]),15)","v":10},1.3933372296902395,8,630000,647000,602466.36382362002,{"$f":"MIN(\n500000,\nAVERAGE(CountyScoresTbl[[#This Row],[Redfin.com \nMedian Sales Price (October 2024)]:[Zillow.com Median Sales Price (October 2024)]]))","v":500000},12052,{"$f":"'HDPL Unit Mix'!$G$16","v":0},{"$f":"'HDPL Unit Mix'!$H$16","v":0},{"$f":"IFERROR(\nCountyScoresTbl[[#This Row],[Affordable Single Family Homes Sold In Last Year (November 2024)\n(Zillow.com)]]/CountyScoresTbl[[#This Row],[CalHome Proposed Number of Loans (entered by Applicant)]],\n0)","v":0},{"$f":"IFERROR(\nCountyScoresTbl[[#This Row],[Affordable Single Family Homes Sold In Last Year (November 2024)\n(Zillow.com)]]/CountyScoresTbl[[#This Row],[Serna Proposed Number of Loans (entered by Applicant)]],\n0)","v":0},{"$f":"IF(AC36>=167, 10,\nIF(AC36>=73, 8,\nIF(AC36>=34, 6,\nIF(AC36>=11, 4,\n2))))","v":2},2,{"$f":"MIN(CountyScoresTbl[[#This Row],[Median Owner Renter Cost Ratio Points]]+CountyScoresTbl[[#This Row],[CalHome Proposed Loans to Sales Ratio Points]],15)","v":10},{"$f":"MIN(CountyScoresTbl[[#This Row],[Median Owner Renter Cost Ratio Points]]+CountyScoresTbl[[#This Row],[Serna Proposed Loans to Sales Ratio Points]],15)","v":10},0.47801082478139273,2,1.2210835133902908E-2,6,{"$f":"MIN(SUM(CountyScoresTbl[[#This Row],[Points Awarded10]],CountyScoresTbl[[#This Row],[Points Awarded12]]),15)","v":8},0.46735253257237264,8,4.6708400646203553E-2,2,{"$f":"MIN(SUM(CountyScoresTbl[[#This Row],[Points Awarded11]],CountyScoresTbl[[#This Row],[Points Awarded13]]),15)","v":10},1.4360746371803732,5,{"$f":"SUM(CountyScoresTbl[[#This Row],[Points Awarded5]],10)","v":15},0,{"$f":"IF(CountyScoresTbl[[#This Row],[OMS Migrant Family Housing Centers In County]]>=3,30,IF(CountyScoresTbl[[#This Row],[OMS Migrant Family Housing Centers In County]]=2,20,IF(CountyScoresTbl[[#This Row],[OMS Migrant Family Housing Centers In County]]=1,10,0)))","v":0}]
["Sacramento",4.8287971905179985,2,0.60723667485806287,3,3.1204982628590797E-2,3,3.0360297440532435E-2,3,{"$f":"MIN(SUM(CountyScoresTbl[[#This Row],[Points Awarded]],CountyScoresTbl[[#This Row],[Points Awarded2]],CountyScoresTbl[[#This Row],[Points Awarded3]],CountyScoresTbl[[#This Row],[Points Awarded4]]),15)","v":11},null,null,4.3342945708088519E-2,4,null,null,0.29604978019936845,4,{"$f":"MIN(SUM(CountyScoresTbl[[#This Row],[Points Awarded6]],CountyScoresTbl[[#This Row],[Points Awarded7]],CountyScoresTbl[[#This Row],[Points Awarded8]],CountyScoresTbl[[#This Row],[Points Awarded9]]),15)","v":8},1.4233896185115698,8,547000,550000,526859.48156879004,{"$f":"MIN(\n500000,\nAVERAGE(CountyScoresTbl[[#This Row],[Redfin.com \nMedian Sales Price (October 2024)]:[Zillow.com Median Sales Price (October 2024)]]))","v":500000},5928,{"$f":"'HDPL Unit Mix'!$G$16","v":0},{"$f":"'HDPL Unit Mix'!$H$16","v":0},{"$f":"IFERROR(\nCountyScoresTbl[[#This Row],[Affordable Single Family Homes Sold In Last Year (November 2024)\n(Zillow.com)]]/CountyScoresTbl[[#This Row],[CalHome Proposed Number of Loans (entered by Applicant)]],\n0)","v":0},{"$f":"IFERROR(\nCountyScoresTbl[[#This Row],[Affordable Single Family Homes Sold In Last Year (November 2024)\n(Zillow.com)]]/CountyScoresTbl[[#This Row],[Serna Proposed Number of Loans (entered by Applicant)]],\n0)","v":0},2,2,{"$f":"MIN(CountyScoresTbl[[#This Row],[Median Owner Renter Cost Ratio Points]]+CountyScoresTbl[[#This Row],[CalHome Proposed Loans to Sales Ratio Points]],15)","v":10},{"$f":"MIN(CountyScoresTbl[[#This Row],[Median Owner Renter Cost Ratio Points]]+CountyScoresTbl[[#This Row],[Serna Proposed Loans to Sales Ratio Points]],15)","v":10},0.64023440352457217,4,7.2441334901863661E-3,4,{"$f":"MIN(SUM(CountyScoresTbl[[#This Row],[Points Awarded10]],CountyScoresTbl[[#This Row],[Points Awarded12]]),15)","v":8},0.40594473904549261,6,3.0360297440532435E-2,6,{"$f":"MIN(SUM(CountyScoresTbl[[#This Row],[Points Awarded11]],CountyScoresTbl[[#This Row],[Points Awarded13]]),15)","v":12},1.4823705926481621,4,{"$f":"SUM(CountyScoresTbl[[#This Row],[Points Awarded5]],10)","v":14},0,{"$f":"IF(CountyScoresTbl[[#This Row],[OMS Migrant Family Housing Centers In County]]>=3,30,IF(CountyScoresTbl[[#This Row],[OMS Migrant Family Housing Centers In County]]=2,20,IF(CountyScoresTbl[[#This Row],[OMS Migrant Family Housing Centers In County]]=1,10,0)))","v":0}]
["San Benito",5.8487874465049927,3,0.57499999999999996,2,5.6451612903225805E-2,4,8.7929656274980013E-3,4,{"$f":"MIN(SUM(CountyScoresTbl[[#This Row],[Points Awarded]],CountyScoresTbl[[#This Row],[Points Awarded2]],CountyScoresTbl[[#This Row],[Points Awarded3]],CountyScoresTbl[[#This Row],[Points Awarded4]]),15)","v":13},null,null,2.4335031126202604E-2,2,null,null,0.24913093858632676,2,{"$f":"MIN(SUM(CountyScoresTbl[[#This Row],[Points Awarded6]],CountyScoresTbl[[#This Row],[Points Awarded7]],CountyScoresTbl[[#This Row],[Points Awarded8]],CountyScoresTbl[[#This Row],[Points Awarded9]]),15)","v":4},1.6896174863387978,2,820000,846268,768596.03951024998,{"$f":"MIN(\n500000,\nAVERAGE(CountyScoresTbl[[#This Row],[Redfin.com \nMedian Sales Price (October 2024)]:[Zillow.com Median Sales Price (October 2024)]]))","v":500000},52,{"$f":"'HDPL Unit Mix'!$G$16","v":0},{"$f":"'HDPL Unit Mix'!$H$16","v":0},{"$f":"IFERROR(\nCountyScoresTbl[[#This Row],[Affordable Single Family Homes Sold In Last Year (November 2024)\n(Zillow.com)]]/CountyScoresTbl[[#This Row],[CalHome Proposed Number of Loans (entered by Applicant)]],\n0)","v":0},{"$f":"IFERROR(\nCountyScoresTbl[[#This Row],[Affordable Single Family Homes Sold In Last Year (November 2024)\n(Zillow.com)]]/CountyScoresTbl[[#This Row],[Serna Proposed Number of Loans (entered by Applicant)]],\n0)","v":0},2,2,{"$f":"MIN(CountyScoresTbl[[#This Row],[Median Owner Renter Cost Ratio Points]]+CountyScoresTbl[[#This Row],[CalHome Proposed Loans to Sales Ratio Points]],15)","v":4},{"$f":"MIN(CountyScoresTbl[[#This Row],[Median Owner Renter Cost Ratio Points]]+CountyScoresTbl[[#This Row],[Serna Proposed Loans to Sales Ratio Points]],15)","v":4},0.48544356995491711,2,9.2699884125144842E-3,6,{"$f":"MIN(SUM(CountyScoresTbl[[#This Row],[Points Awarded10]],CountyScoresTbl[[#This Row],[Points Awarded12]]),15)","v":8},0.36465638148667601,4,8.7929656274980013E-3,8,{"$f":"MIN(SUM(CountyScoresTbl[[#This Row],[Points Awarded11]],CountyScoresTbl[[#This Row],[Points Awarded13]]),15)","v":12},1.7142857142857142,2,{"$f":"SUM(CountyScoresTbl[[#This Row],[Points Awarded5]],10)","v":12},0,{"$f":"IF(CountyScoresTbl[[#This Row],[OMS Migrant Family Housing Centers In County]]>=3,30,IF(CountyScoresTbl[[#This Row],[OMS Migrant Family Housing Centers In County]]=2,20,IF(CountyScoresTbl[[#This Row],[OMS Migrant Family Housing Centers In County]]=1,10,0)))","v":0}]
["San Bernardino",5.1179487179487175,2,0.59001145653313658,2,4.2447426163614826E-2,3,3.3807996097634192E-2,3,{"$f":"MIN(SUM(CountyScoresTbl[[#This Row],[Points Awarded]],CountyScoresTbl[[#This Row],[Points Awarded2]],CountyScoresTbl[[#This Row],[Points Awarded3]],CountyScoresTbl[[#This Row],[Points Awarded4]]),15)","v":10},null,null,5.7002522317564724E-2,6,null,null,0.31047558655675334,4,{"$f":"MIN(SUM(CountyScoresTbl[[#This Row],[Points Awarded6]],CountyScoresTbl[[#This Row],[Points Awarded7]],CountyScoresTbl[[#This Row],[Points Awarded8]],CountyScoresTbl[[#This Row],[Points Awarded9]]),15)","v":10},1.3718434343434343,8,550000,530000,541542.98440704704,{"$f":"MIN(\n500000,\nAVERAGE(CountyScoresTbl[[#This Row],[Redfin.com \nMedian Sales Price (October 2024)]:[Zillow.com Median Sales Price (October 2024)]]))","v":500000},10772,{"$f":"'HDPL Unit Mix'!$G$16","v":0},{"$f":"'HDPL Unit Mix'!$H$16","v":0},{"$f":"IFERROR(\nCountyScoresTbl[[#This Row],[Affordable Single Family Homes Sold In Last Year (November 2024)\n(Zillow.com)]]/CountyScoresTbl[[#This Row],[CalHome Proposed Number of Loans (entered by Applicant)]],\n0)","v":0},{"$f":"IFERROR(\nCountyScoresTbl[[#This Row],[Affordable Single Family Homes Sold In Last Year (November 2024)\n(Zillow.com)]]/CountyScoresTbl[[#This Row],[Serna Proposed Number of Loans (entered by Applicant)]],\n0)","v":0},2,2,{"$f":"MIN(CountyScoresTbl[[#This Row],[Median Owner Renter Cost Ratio Points]]+CountyScoresTbl[[#This Row],[CalHome Proposed Loans to Sales Ratio Points]],15)","v":10},{"$f":"MIN(CountyScoresTbl[[#This Row],[Median Owner Renter Cost Ratio Points]]+CountyScoresTbl[[#This Row],[Serna Proposed Loans to Sales Ratio Points]],15)","v":10},0.6537304176331229,6,1.4013950538998097E-2,8,{"$f":"MIN(SUM(CountyScoresTbl[[#This Row],[Points Awarded10]],CountyScoresTbl[[#This Row],[Points Awarded12]]),15)","v":14},0.44772091492512756,8,3.3807996097634192E-2,6,{"$f":"MIN(SUM(CountyScoresTbl[[#This Row],[Points Awarded11]],CountyScoresTbl[[#This Row],[Points Awarded13]]),15)","v":14},1.3998505231689089,5,{"$f":"SUM(CountyScoresTbl[[#This Row],[Points Awarded5]],10)","v":15},1,{"$f":"IF(CountyScoresTbl[[#This Row],[OMS Migrant Family Housing Centers In County]]>=3,30,IF(CountyScoresTbl[[#This Row],[OMS Migrant Family Housing Centers In County]]=2,20,IF(CountyScoresTbl[[#This Row],[OMS Migrant Family Housing Centers In County]]=1,10,0)))","v":10}]
["San Diego",8.451882845188285,3,0.61518412083138407,3,4.203702466083005E-2,3,3.7749196141479098E-2,2,{"$f":"MIN(SUM(CountyScoresTbl[[#This Row],[Points Awarded]],CountyScoresTbl[[#This Row],[Points Awarded2]],CountyScoresTbl[[#This Row],[Points Awarded3]],CountyScoresTbl[[#This Row],[Points Awarded4]]),15)","v":11},null,null,3.3128747583759437E-2,2,null,null,0.32733144540283515,6,{"$f":"MIN(SUM(CountyScoresTbl[[#This Row],[Points Awarded6]],CountyScoresTbl[[#This Row],[Points Awarded7]],CountyScoresTbl[[#This Row],[Points Awarded8]],CountyScoresTbl[[#This Row],[Points Awarded9]]),15)","v":8},1.488314271506713,6,1005000,979200,935062.16512997996,{"$f":"MIN(\n500000,\nAVERAGE(CountyScoresTbl[[#This Row],[Redfin.com \nMedian Sales Price (October 2024)]:[Zillow.com Median Sales Price (October 2024)]]))","v":500000},3441,{"$f":"'HDPL Unit Mix'!$G$16","v":0},{"$f":"'HDPL Unit Mix'!$H$16","v":0},{"$f":"IFERROR(\nCountyScoresTbl[[#This Row],[Affordable Single Family Homes Sold In Last Year (November 2024)\n(Zillow.com)]]/CountyScoresTbl[[#This Row],[CalHome Proposed Number of Loans (entered by Applicant)]],\n0)","v":0},{"$f":"IFERROR(\nCountyScoresTbl[[#This Row],[Affordable Single Family Homes Sold In Last Year (November 2024)\n(Zillow.com)]]/CountyScoresTbl[[#This Row],[Serna Proposed Number of Loans (entered by Applicant)]],\n0)","v":0},2,2,{"$f":"MIN(CountyScoresTbl[[#This Row],[Median Owner Renter Cost Ratio Points]]+CountyScoresTbl[[#This Row],[CalHome Proposed Loans to Sales Ratio Points]],15)","v":8},{"$f":"MIN(CountyScoresTbl[[#This Row],[Median Owner Renter Cost Ratio Points]]+CountyScoresTbl[[#This Row],[Serna Proposed Loans to Sales Ratio Points]],15)","v":8},0.70272910894456597,6,9.0312319963647865E-3,6,{"$f":"MIN(SUM(CountyScoresTbl[[#This Row],[Points Awarded10]],CountyScoresTbl[[#This Row],[Points Awarded12]]),15)","v":12},0.43322728330876076,8,3.7749196141479098E-2,4,{"$f":"MIN(SUM(CountyScoresTbl[[#This Row],[Points Awarded11]],CountyScoresTbl[[#This Row],[Points Awarded13]]),15)","v":12},1.5317551963048499,3,{"$f":"SUM(CountyScoresTbl[[#This Row],[Points Awarded5]],10)","v":13},0,{"$f":"IF(CountyScoresTbl[[#This Row],[OMS Migrant Family Housing Centers In County]]>=3,30,IF(CountyScoresTbl[[#This Row],[OMS Migrant Family Housing Centers In County]]=2,20,IF(CountyScoresTbl[[#This Row],[OMS Migrant Family Housing Centers In County]]=1,10,0)))","v":0}]
["San Francisco",9.3783494105037519,4,0.50036966506105074,1,5.5897838019491428E-2,4,4.9064723678043376E-2,1,{"$f":"MIN(SUM(CountyScoresTbl[[#This Row],[Points Awarded]],CountyScoresTbl[[#This Row],[Points Awarded2]],CountyScoresTbl[[#This Row],[Points Awarded3]],CountyScoresTbl[[#This Row],[Points Awarded4]]),15)","v":10},null,null,2.9124857652392516E-2,2,null,null,0.3626946758420862,8,{"$f":"MIN(SUM(CountyScoresTbl[[#This Row],[Points Awarded6]],CountyScoresTbl[[#This Row],[Points Awarded7]],CountyScoresTbl[[#This Row],[Points Awarded8]],CountyScoresTbl[[#This Row],[Points Awarded9]]),15)","v":10},1.7275474956822108,2,1750000,1195000,1262427.32896732,{"$f":"MIN(\n500000,\nAVERAGE(CountyScoresTbl[[#This Row],[Redfin.com \nMedian Sales Price (October 2024)]:[Zillow.com Median Sales Price (October 2024)]]))","v":500000},276,{"$f":"'HDPL Unit Mix'!$G$16","v":0},{"$f":"'HDPL Unit Mix'!$H$16","v":0},{"$f":"IFERROR(\nCountyScoresTbl[[#This Row],[Affordable Single Family Homes Sold In Last Year (November 2024)\n(Zillow.com)]]/CountyScoresTbl[[#This Row],[CalHome Proposed Number of Loans (entered by Applicant)]],\n0)","v":0},{"$f":"IFERROR(\nCountyScoresTbl[[#This Row],[Affordable Single Family Homes Sold In Last Year (November 2024)\n(Zillow.com)]]/CountyScoresTbl[[#This Row],[Serna Proposed Number of Loans (entered by Applicant)]],\n0)","v":0},2,2,{"$f":"MIN(CountyScoresTbl[[#This Row],[Median Owner Renter Cost Ratio Points]]+CountyScoresTbl[[#This Row],[CalHome Proposed Loans to Sales Ratio Points]],15)","v":4},{"$f":"MIN(CountyScoresTbl[[#This Row],[Median Owner Renter Cost Ratio Points]]+CountyScoresTbl[[#This Row],[Serna Proposed Loans to Sales Ratio Points]],15)","v":4},0.84766060222690254,8,1.5139442231075698E-2,8,{"$f":"MIN(SUM(CountyScoresTbl[[#This Row],[Points Awarded10]],CountyScoresTbl[[#This Row],[Points Awarded12]]),15)","v":15},0.32528879734933286,2,4.9064723678043376E-2,2,{"$f":"MIN(SUM(CountyScoresTbl[[#This Row],[Points Awarded11]],CountyScoresTbl[[#This Row],[Points Awarded13]]),15)","v":4},1.9014925373134328,1,{"$f":"SUM(CountyScoresTbl[[#This Row],[Points Awarded5]],10)","v":11},0,{"$f":"IF(CountyScoresTbl[[#This Row],[OMS Migrant Family Housing Centers In County]]>=3,30,IF(CountyScoresTbl[[#This Row],[OMS Migrant Family Housing Centers In County]]=2,20,IF(CountyScoresTbl[[#This Row],[OMS Migrant Family Housing Centers In County]]=1,10,0)))","v":0}]
["San Joaquin",5.3367052023121389,3,0.54667709147771693,1,3.7842064112587961E-2,3,3.6317058468957206E-2,2,{"$f":"MIN(SUM(CountyScoresTbl[[#This Row],[Points Awarded]],CountyScoresTbl[[#This Row],[Points Awarded2]],CountyScoresTbl[[#This Row],[Points Awarded3]],CountyScoresTbl[[#This Row],[Points Awarded4]]),15)","v":9},null,null,4.7171172471008348E-2,6,null,null,0.24899989188020327,2,{"$f":"MIN(SUM(CountyScoresTbl[[#This Row],[Points Awarded6]],CountyScoresTbl[[#This Row],[Points Awarded7]],CountyScoresTbl[[#This Row],[Points Awarded8]],CountyScoresTbl[[#This Row],[Points Awarded9]]),15)","v":8},1.4766536964980546,6,563750,571079,536865.59547571896,{"$f":"MIN(\n500000,\nAVERAGE(CountyScoresTbl[[#This Row],[Redfin.com \nMedian Sales Price (October 2024)]:[Zillow.com Median Sales Price (October 2024)]]))","v":500000},2977,{"$f":"'HDPL Unit Mix'!$G$16","v":0},{"$f":"'HDPL Unit Mix'!$H$16","v":0},{"$f":"IFERROR(\nCountyScoresTbl[[#This Row],[Affordable Single Family Homes Sold In Last Year (November 2024)\n(Zillow.com)]]/CountyScoresTbl[[#This Row],[CalHome Proposed Number of Loans (entered by Applicant)]],\n0)","v":0},{"$f":"IFERROR(\nCountyScoresTbl[[#This Row],[Affordable Single Family Homes Sold In Last Year (November 2024)\n(Zillow.com)]]/CountyScoresTbl[[#This Row],[Serna Proposed Number of Loans (entered by Applicant)]],\n0)","v":0},2,2,{"$f":"MIN(CountyScoresTbl[[#This Row],[Median Owner Renter Cost Ratio Points]]+CountyScoresTbl[[#This Row],[CalHome Proposed Loans to Sales Ratio Points]],15)","v":8},{"$f":"MIN(CountyScoresTbl[[#This Row],[Median Owner Renter Cost Ratio Points]]+CountyScoresTbl[[#This Row],[Serna Proposed Loans to Sales Ratio Points]],15)","v":8},0.53480908203467914,2,1.3406854795112985E-2,8,{"$f":"MIN(SUM(CountyScoresTbl[[#This Row],[Points Awarded10]],CountyScoresTbl[[#This Row],[Points Awarded12]]),15)","v":10},0.41485507246376813,6,3.6317058468957206E-2,4,{"$f":"MIN(SUM(CountyScoresTbl[[#This Row],[Points Awarded11]],CountyScoresTbl[[#This Row],[Points Awarded13]]),15)","v":10},1.5326594090202177,3,{"$f":"SUM(CountyScoresTbl[[#This Row],[Points Awarded5]],10)","v":13},3,{"$f":"IF(CountyScoresTbl[[#This Row],[OMS Migrant Family Housing Centers In County]]>=3,30,IF(CountyScoresTbl[[#This Row],[OMS Migrant Family Housing Centers In County]]=2,20,IF(CountyScoresTbl[[#This Row],[OMS Migrant Family Housing Centers In County]]=1,10,0)))","v":30}]
["San Luis Obispo",7.5079617834394901,3,0.59142999501743898,2,1.7189835575485798E-2,2,4.2690197948962554E-2,2,{"$f":"MIN(SUM(CountyScoresTbl[[#This Row],[Points Awarded]],CountyScoresTbl[[#This Row],[Points Awarded2]],CountyScoresTbl[[#This Row],[Points Awarded3]],CountyScoresTbl[[#This Row],[Points Awarded4]]),15)","v":9},null,null,3.6060113895684712E-2,4,null,null,0.31455363840960238,4,{"$f":"MIN(SUM(CountyScoresTbl[[#This Row],[Points Awarded6]],CountyScoresTbl[[#This Row],[Points Awarded7]],CountyScoresTbl[[#This Row],[Points Awarded8]],CountyScoresTbl[[#This Row],[Points Awarded9]]),15)","v":8},1.5116666666666667,6,926500,1160000,883347.31620283797,{"$f":"MIN(\n500000,\nAVERAGE(CountyScoresTbl[[#This Row],[Redfin.com \nMedian Sales Price (October 2024)]:[Zillow.com Median Sales Price (October 2024)]]))","v":500000},686,{"$f":"'HDPL Unit Mix'!$G$16","v":0},{"$f":"'HDPL Unit Mix'!$H$16","v":0},{"$f":"IFERROR(\nCountyScoresTbl[[#This Row],[Affordable Single Family Homes Sold In Last Year (November 2024)\n(Zillow.com)]]/CountyScoresTbl[[#This Row],[CalHome Proposed Number of Loans (entered by Applicant)]],\n0)","v":0},{"$f":"IFERROR(\nCountyScoresTbl[[#This Row],[Affordable Single Family Homes Sold In Last Year (November 2024)\n(Zillow.com)]]/CountyScoresTbl[[#This Row],[Serna Proposed Number of Loans (entered by Applicant)]],\n0)","v":0},2,2,{"$f":"MIN(CountyScoresTbl[[#This Row],[Median Owner Renter Cost Ratio Points]]+CountyScoresTbl[[#This Row],[CalHome Proposed Loans to Sales Ratio Points]],15)","v":8},{"$f":"MIN(CountyScoresTbl[[#This Row],[Median Owner Renter Cost Ratio Points]]+CountyScoresTbl[[#This Row],[Serna Proposed Loans to Sales Ratio Points]],15)","v":8},0.62141397263952503,4,5.326331582895724E-3,4,{"$f":"MIN(SUM(CountyScoresTbl[[#This Row],[Points Awarded10]],CountyScoresTbl[[#This Row],[Points Awarded12]]),15)","v":8},0.44418702611625949,8,4.2690197948962554E-2,4,{"$f":"MIN(SUM(CountyScoresTbl[[#This Row],[Points Awarded11]],CountyScoresTbl[[#This Row],[Points Awarded13]]),15)","v":12},1.562214983713355,3,{"$f":"SUM(CountyScoresTbl[[#This Row],[Points Awarded5]],10)","v":13},0,{"$f":"IF(CountyScoresTbl[[#This Row],[OMS Migrant Family Housing Centers In County]]>=3,30,IF(CountyScoresTbl[[#This Row],[OMS Migrant Family Housing Centers In County]]=2,20,IF(CountyScoresTbl[[#This Row],[OMS Migrant Family Housing Centers In County]]=1,10,0)))","v":0}]
["San Mateo",10.718113612004288,4,0.54169402495075514,1,6.5050182909670767E-2,4,5.925435693801015E-2,1,{"$f":"MIN(SUM(CountyScoresTbl[[#This Row],[Points Awarded]],CountyScoresTbl[[#This Row],[Points Awarded2]],CountyScoresTbl[[#This Row],[Points Awarded3]],CountyScoresTbl[[#This Row],[Points Awarded4]]),15)","v":10},null,null,2.0448787549764747E-2,2,null,null,0.33595526914329038,6,{"$f":"MIN(SUM(CountyScoresTbl[[#This Row],[Points Awarded6]],CountyScoresTbl[[#This Row],[Points Awarded7]],CountyScoresTbl[[#This Row],[Points Awarded8]],CountyScoresTbl[[#This Row],[Points Awarded9]]),15)","v":8},1.4263814616755792,8,1950000,1569444,1553138.36199089,{"$f":"MIN(\n500000,\nAVERAGE(CountyScoresTbl[[#This Row],[Redfin.com \nMedian Sales Price (October 2024)]:[Zillow.com Median Sales Price (October 2024)]]))","v":500000},251,{"$f":"'HDPL Unit Mix'!$G$16","v":0},{"$f":"'HDPL Unit Mix'!$H$16","v":0},{"$f":"IFERROR(\nCountyScoresTbl[[#This Row],[Affordable Single Family Homes Sold In Last Year (November 2024)\n(Zillow.com)]]/CountyScoresTbl[[#This Row],[CalHome Proposed Number of Loans (entered by Applicant)]],\n0)","v":0},{"$f":"IFERROR(\nCountyScoresTbl[[#This Row],[Affordable Single Family Homes Sold In Last Year (November 2024)\n(Zillow.com)]]/CountyScoresTbl[[#This Row],[Serna Proposed Number of Loans (entered by Applicant)]],\n0)","v":0},2,2,{"$f":"MIN(CountyScoresTbl[[#This Row],[Median Owner Renter Cost Ratio Points]]+CountyScoresTbl[[#This Row],[CalHome Proposed Loans to Sales Ratio Points]],15)","v":10},{"$f":"MIN(CountyScoresTbl[[#This Row],[Median Owner Renter Cost Ratio Points]]+CountyScoresTbl[[#This Row],[Serna Proposed Loans to Sales Ratio Points]],15)","v":10},0.87046921864673887,8,8.339651250947688E-3,6,{"$f":"MIN(SUM(CountyScoresTbl[[#This Row],[Points Awarded10]],CountyScoresTbl[[#This Row],[Points Awarded12]]),15)","v":14},0.43272727272727274,8,5.925435693801015E-2,2,{"$f":"MIN(SUM(CountyScoresTbl[[#This Row],[Points Awarded11]],CountyScoresTbl[[#This Row],[Points Awarded13]]),15)","v":10},1.4997946611909652,4,{"$f":"SUM(CountyScoresTbl[[#This Row],[Points Awarded5]],10)","v":14},0,{"$f":"IF(CountyScoresTbl[[#This Row],[OMS Migrant Family Housing Centers In County]]>=3,30,IF(CountyScoresTbl[[#This Row],[OMS Migrant Family Housing Centers In County]]=2,20,IF(CountyScoresTbl[[#This Row],[OMS Migrant Family Housing Centers In County]]=1,10,0)))","v":0}]
["Santa Barbara",8.7951301427371948,4,0.57444372898332974,2,6.8469628675681474E-2,4,2.8227768893832998E-2,4,{"$f":"MIN(SUM(CountyScoresTbl[[#This Row],[Points Awarded]],CountyScoresTbl[[#This Row],[Points Awarded2]],CountyScoresTbl[[#This Row],[Points Awarded3]],CountyScoresTbl[[#This Row],[Points Awarded4]]),15)","v":14},null,null,3.4270785308129707E-2,4,null,null,0.28273061303422936,2,{"$f":"MIN(SUM(CountyScoresTbl[[#This Row],[Points Awarded6]],CountyScoresTbl[[#This Row],[Points Awarded7]],CountyScoresTbl[[#This Row],[Points Awarded8]],CountyScoresTbl[[#This Row],[Points Awarded9]]),15)","v":6},1.415478615071283,8,826750,1935000,966400.79164026305,{"$f":"MIN(\n500000,\nAVERAGE(CountyScoresTbl[[#This Row],[Redfin.com \nMedian Sales Price (October 2024)]:[Zillow.com Median Sales Price (October 2024)]]))","v":500000},607,{"$f":"'HDPL Unit Mix'!$G$16","v":0},{"$f":"'HDPL Unit Mix'!$H$16","v":0},{"$f":"IFERROR(\nCountyScoresTbl[[#This Row],[Affordable Single Family Homes Sold In Last Year (November 2024)\n(Zillow.com)]]/CountyScoresTbl[[#This Row],[CalHome Proposed Number of Loans (entered by Applicant)]],\n0)","v":0},{"$f":"IFERROR(\nCountyScoresTbl[[#This Row],[Affordable Single Family Homes Sold In Last Year (November 2024)\n(Zillow.com)]]/CountyScoresTbl[[#This Row],[Serna Proposed Number of Loans (entered by Applicant)]],\n0)","v":0},2,2,{"$f":"MIN(CountyScoresTbl[[#This Row],[Median Owner Renter Cost Ratio Points]]+CountyScoresTbl[[#This Row],[CalHome Proposed Loans to Sales Ratio Points]],15)","v":10},{"$f":"MIN(CountyScoresTbl[[#This Row],[Median Owner Renter Cost Ratio Points]]+CountyScoresTbl[[#This Row],[Serna Proposed Loans to Sales Ratio Points]],15)","v":10},0.78477126189745161,8,1.6179978082898214E-2,8,{"$f":"MIN(SUM(CountyScoresTbl[[#This Row],[Points Awarded10]],CountyScoresTbl[[#This Row],[Points Awarded12]]),15)","v":15},0.42408768215219828,6,2.8227768893832998E-2,8,{"$f":"MIN(SUM(CountyScoresTbl[[#This Row],[Points Awarded11]],CountyScoresTbl[[#This Row],[Points Awarded13]]),15)","v":14},1.4419563936358279,5,{"$f":"SUM(CountyScoresTbl[[#This Row],[Points Awarded5]],10)","v":15},0,{"$f":"IF(CountyScoresTbl[[#This Row],[OMS Migrant Family Housing Centers In County]]>=3,30,IF(CountyScoresTbl[[#This Row],[OMS Migrant Family Housing Centers In County]]=2,20,IF(CountyScoresTbl[[#This Row],[OMS Migrant Family Housing Centers In County]]=1,10,0)))","v":0}]
["Santa Clara",10.797612588171459,4,0.49828190805124317,1,5.4644134698408779E-2,4,4.8681541582150101E-2,1,{"$f":"MIN(SUM(CountyScoresTbl[[#This Row],[Points Awarded]],CountyScoresTbl[[#This Row],[Points Awarded2]],CountyScoresTbl[[#This Row],[Points Awarded3]],CountyScoresTbl[[#This Row],[Points Awarded4]]),15)","v":10},null,null,2.1839802137497789E-2,2,null,null,0.29335867035705926,4,{"$f":"MIN(SUM(CountyScoresTbl[[#This Row],[Points Awarded6]],CountyScoresTbl[[#This Row],[Points Awarded7]],CountyScoresTbl[[#This Row],[Points Awarded8]],CountyScoresTbl[[#This Row],[Points Awarded9]]),15)","v":6},1.4714968738506804,6,1960000,1449944,1613015.6840679999,{"$f":"MIN(\n500000,\nAVERAGE(CountyScoresTbl[[#This Row],[Redfin.com \nMedian Sales Price (October 2024)]:[Zillow.com Median Sales Price (October 2024)]]))","v":500000},946,{"$f":"'HDPL Unit Mix'!$G$16","v":0},{"$f":"'HDPL Unit Mix'!$H$16","v":0},{"$f":"IFERROR(\nCountyScoresTbl[[#This Row],[Affordable Single Family Homes Sold In Last Year (November 2024)\n(Zillow.com)]]/CountyScoresTbl[[#This Row],[CalHome Proposed Number of Loans (entered by Applicant)]],\n0)","v":0},{"$f":"IFERROR(\nCountyScoresTbl[[#This Row],[Affordable Single Family Homes Sold In Last Year (November 2024)\n(Zillow.com)]]/CountyScoresTbl[[#This Row],[Serna Proposed Number of Loans (entered by Applicant)]],\n0)","v":0},2,2,{"$f":"MIN(CountyScoresTbl[[#This Row],[Median Owner Renter Cost Ratio Points]]+CountyScoresTbl[[#This Row],[CalHome Proposed Loans to Sales Ratio Points]],15)","v":8},{"$f":"MIN(CountyScoresTbl[[#This Row],[Median Owner Renter Cost Ratio Points]]+CountyScoresTbl[[#This Row],[Serna Proposed Loans to Sales Ratio Points]],15)","v":8},0.77931467483148986,8,8.1243717382024488E-3,6,{"$f":"MIN(SUM(CountyScoresTbl[[#This Row],[Points Awarded10]],CountyScoresTbl[[#This Row],[Points Awarded12]]),15)","v":14},0.39081232096757079,4,4.8681541582150101E-2,2,{"$f":"MIN(SUM(CountyScoresTbl[[#This Row],[Points Awarded11]],CountyScoresTbl[[#This Row],[Points Awarded13]]),15)","v":6},1.4870075440067059,4,{"$f":"SUM(CountyScoresTbl[[#This Row],[Points Awarded5]],10)","v":14},1,{"$f":"IF(CountyScoresTbl[[#This Row],[OMS Migrant Family Housing Centers In County]]>=3,30,IF(CountyScoresTbl[[#This Row],[OMS Migrant Family Housing Centers In County]]=2,20,IF(CountyScoresTbl[[#This Row],[OMS Migrant Family Housing Centers In County]]=1,10,0)))","v":10}]
["Santa Cruz",9.9774096385542173,4,0.65967763071681296,4,5.7266413314113487E-2,4,2.7030473033278081E-2,4,{"$f":"MIN(SUM(CountyScoresTbl[[#This Row],[Points Awarded]],CountyScoresTbl[[#This Row],[Points Awarded2]],CountyScoresTbl[[#This Row],[Points Awarded3]],CountyScoresTbl[[#This Row],[Points Awarded4]]),15)","v":15},null,null,3.5597912634441529E-2,4,null,null,0.34936556927297668,8,{"$f":"MIN(SUM(CountyScoresTbl[[#This Row],[Points Awarded6]],CountyScoresTbl[[#This Row],[Points Awarded7]],CountyScoresTbl[[#This Row],[Points Awarded8]],CountyScoresTbl[[#This Row],[Points Awarded9]]),15)","v":12},1.5998089780324738,4,1325000,1295000,1143225.09051818,{"$f":"MIN(\n500000,\nAVERAGE(CountyScoresTbl[[#This Row],[Redfin.com \nMedian Sales Price (October 2024)]:[Zillow.com Median Sales Price (October 2024)]]))","v":500000},318,{"$f":"'HDPL Unit Mix'!$G$16","v":0},{"$f":"'HDPL Unit Mix'!$H$16","v":0},{"$f":"IFERROR(\nCountyScoresTbl[[#This Row],[Affordable Single Family Homes Sold In Last Year (November 2024)\n(Zillow.com)]]/CountyScoresTbl[[#This Row],[CalHome Proposed Number of Loans (entered by Applicant)]],\n0)","v":0},{"$f":"IFERROR(\nCountyScoresTbl[[#This Row],[Affordable Single Family Homes Sold In Last Year (November 2024)\n(Zillow.com)]]/CountyScoresTbl[[#This Row],[Serna Proposed Number of Loans (entered by Applicant)]],\n0)","v":0},2,2,{"$f":"MIN(CountyScoresTbl[[#This Row],[Median Owner Renter Cost Ratio Points]]+CountyScoresTbl[[#This Row],[CalHome Proposed Loans to Sales Ratio Points]],15)","v":6},{"$f":"MIN(CountyScoresTbl[[#This Row],[Median Owner Renter Cost Ratio Points]]+CountyScoresTbl[[#This Row],[Serna Proposed Loans to Sales Ratio Points]],15)","v":6},0.81231418101362096,8,7.2016460905349796E-3,4,{"$f":"MIN(SUM(CountyScoresTbl[[#This Row],[Points Awarded10]],CountyScoresTbl[[#This Row],[Points Awarded12]]),15)","v":12},0.40325784664282877,6,2.7030473033278081E-2,8,{"$f":"MIN(SUM(CountyScoresTbl[[#This Row],[Points Awarded11]],CountyScoresTbl[[#This Row],[Points Awarded13]]),15)","v":14},1.5919696147585458,3,{"$f":"SUM(CountyScoresTbl[[#This Row],[Points Awarded5]],10)","v":13},1,{"$f":"IF(CountyScoresTbl[[#This Row],[OMS Migrant Family Housing Centers In County]]>=3,30,IF(CountyScoresTbl[[#This Row],[OMS Migrant Family Housing Centers In County]]=2,20,IF(CountyScoresTbl[[#This Row],[OMS Migrant Family Housing Centers In County]]=1,10,0)))","v":10}]
["Shasta",4.2204899777282847,1,0.55685188847142575,1,1.2260233339924856E-2,1,5.4412864622288705E-2,1,{"$f":"MIN(SUM(CountyScoresTbl[[#This Row],[Points Awarded]],CountyScoresTbl[[#This Row],[Points Awarded2]],CountyScoresTbl[[#This Row],[Points Awarded3]],CountyScoresTbl[[#This Row],[Points Awarded4]]),15)","v":4},null,null,4.5349824178489151E-2,6,null,null,0.31805344340647401,4,{"$f":"MIN(SUM(CountyScoresTbl[[#This Row],[Points Awarded6]],CountyScoresTbl[[#This Row],[Points Awarded7]],CountyScoresTbl[[#This Row],[Points Awarded8]],CountyScoresTbl[[#This Row],[Points Awarded9]]),15)","v":10},1.5097402597402598,6,380510,429900,369540.622232222,{"$f":"MIN(\n500000,\nAVERAGE(CountyScoresTbl[[#This Row],[Redfin.com \nMedian Sales Price (October 2024)]:[Zillow.com Median Sales Price (October 2024)]]))","v":393316.87407740735},1575,{"$f":"'HDPL Unit Mix'!$G$16","v":0},{"$f":"'HDPL Unit Mix'!$H$16","v":0},{"$f":"IFERROR(\nCountyScoresTbl[[#This Row],[Affordable Single Family Homes Sold In Last Year (November 2024)\n(Zillow.com)]]/CountyScoresTbl[[#This Row],[CalHome Proposed Number of Loans (entered by Applicant)]],\n0)","v":0},{"$f":"IFERROR(\nCountyScoresTbl[[#This Row],[Affordable Single Family Homes Sold In Last Year (November 2024)\n(Zillow.com)]]/CountyScoresTbl[[#This Row],[Serna Proposed Number of Loans (entered by Applicant)]],\n0)","v":0},2,2,{"$f":"MIN(CountyScoresTbl[[#This Row],[Median Owner Renter Cost Ratio Points]]+CountyScoresTbl[[#This Row],[CalHome Proposed Loans to Sales Ratio Points]],15)","v":8},{"$f":"MIN(CountyScoresTbl[[#This Row],[Median Owner Renter Cost Ratio Points]]+CountyScoresTbl[[#This Row],[Serna Proposed Loans to Sales Ratio Points]],15)","v":8},0.63462827247767906,4,4.8881164457962199E-3,4,{"$f":"MIN(SUM(CountyScoresTbl[[#This Row],[Points Awarded10]],CountyScoresTbl[[#This Row],[Points Awarded12]]),15)","v":8},0.43607954545454547,8,5.4412864622288705E-2,2,{"$f":"MIN(SUM(CountyScoresTbl[[#This Row],[Points Awarded11]],CountyScoresTbl[[#This Row],[Points Awarded13]]),15)","v":10},1.5023255813953489,4,{"$f":"SUM(CountyScoresTbl[[#This Row],[Points Awarded5]],10)","v":14},0,{"$f":"IF(CountyScoresTbl[[#This Row],[OMS Migrant Family Housing Centers In County]]>=3,30,IF(CountyScoresTbl[[#This Row],[OMS Migrant Family Housing Centers In County]]=2,20,IF(CountyScoresTbl[[#This Row],[OMS Migrant Family Housing Centers In County]]=1,10,0)))","v":0}]
["Sierra",15,4,0.42857142857142855,1,0,1,0,4,{"$f":"MIN(SUM(CountyScoresTbl[[#This Row],[Points Awarded]],CountyScoresTbl[[#This Row],[Points Awarded2]],CountyScoresTbl[[#This Row],[Points Awarded3]],CountyScoresTbl[[#This Row],[Points Awarded4]]),15)","v":10},null,null,7.4468085106382975E-2,8,null,null,0.34615384615384615,8,{"$f":"MIN(SUM(CountyScoresTbl[[#This Row],[Points Awarded6]],CountyScoresTbl[[#This Row],[Points Awarded7]],CountyScoresTbl[[#This Row],[Points Awarded8]],CountyScoresTbl[[#This Row],[Points Awarded9]]),15)","v":15},1.4366554054054055,8,360000,536250,335074.77385696798,{"$f":"MIN(\n500000,\nAVERAGE(CountyScoresTbl[[#This Row],[Redfin.com \nMedian Sales Price (October 2024)]:[Zillow.com Median Sales Price (October 2024)]]))","v":410441.59128565597},49,{"$f":"'HDPL Unit Mix'!$G$16","v":0},{"$f":"'HDPL Unit Mix'!$H$16","v":0},{"$f":"IFERROR(\nCountyScoresTbl[[#This Row],[Affordable Single Family Homes Sold In Last Year (November 2024)\n(Zillow.com)]]/CountyScoresTbl[[#This Row],[CalHome Proposed Number of Loans (entered by Applicant)]],\n0)","v":0},{"$f":"IFERROR(\nCountyScoresTbl[[#This Row],[Affordable Single Family Homes Sold In Last Year (November 2024)\n(Zillow.com)]]/CountyScoresTbl[[#This Row],[Serna Proposed Number of Loans (entered by Applicant)]],\n0)","v":0},2,2,{"$f":"MIN(CountyScoresTbl[[#This Row],[Median Owner Renter Cost Ratio Points]]+CountyScoresTbl[[#This Row],[CalHome Proposed Loans to Sales Ratio Points]],15)","v":10},{"$f":"MIN(CountyScoresTbl[[#This Row],[Median Owner Renter Cost Ratio Points]]+CountyScoresTbl[[#This Row],[Serna Proposed Loans to Sales Ratio Points]],15)","v":10},0.79574468085106387,8,0,2,{"$f":"MIN(SUM(CountyScoresTbl[[#This Row],[Points Awarded10]],CountyScoresTbl[[#This Row],[Points Awarded12]]),15)","v":10},0.33333333333333331,2,0,8,{"$f":"MIN(SUM(CountyScoresTbl[[#This Row],[Points Awarded11]],CountyScoresTbl[[#This Row],[Points Awarded13]]),15)","v":10},1.5116279069767442,4,{"$f":"SUM(CountyScoresTbl[[#This Row],[Points Awarded5]],10)","v":14},0,{"$f":"IF(CountyScoresTbl[[#This Row],[OMS Migrant Family Housing Centers In County]]>=3,30,IF(CountyScoresTbl[[#This Row],[OMS Migrant Family Housing Centers In County]]=2,20,IF(CountyScoresTbl[[#This Row],[OMS Migrant Family Housing Centers In County]]=1,10,0)))","v":0}]
["Siskiyou",3.4271899886234358,1,0.66261151662611517,4,1.3787510137875101E-2,1,3.5965598123534011E-2,2,{"$f":"MIN(SUM(CountyScoresTbl[[#This Row],[Points Awarded]],CountyScoresTbl[[#This Row],[Points Awarded2]],CountyScoresTbl[[#This Row],[Points Awarded3]],CountyScoresTbl[[#This Row],[Points Awarded4]]),15)","v":8},null,null,5.6526079361118045E-2,6,null,null,0.40168878166465621,8,{"$f":"MIN(SUM(CountyScoresTbl[[#This Row],[Points Awarded6]],CountyScoresTbl[[#This Row],[Points Awarded7]],CountyScoresTbl[[#This Row],[Points Awarded8]],CountyScoresTbl[[#This Row],[Points Awarded9]]),15)","v":14},1.6514227642276422,4,287500,370000,287333.76887638,{"$f":"MIN(\n500000,\nAVERAGE(CountyScoresTbl[[#This Row],[Redfin.com \nMedian Sales Price (October 2024)]:[Zillow.com Median Sales Price (October 2024)]]))","v":314944.58962546004},357,{"$f":"'HDPL Unit Mix'!$G$16","v":0},{"$f":"'HDPL Unit Mix'!$H$16","v":0},{"$f":"IFERROR(\nCountyScoresTbl[[#This Row],[Affordable Single Family Homes Sold In Last Year (November 2024)\n(Zillow.com)]]/CountyScoresTbl[[#This Row],[CalHome Proposed Number of Loans (entered by Applicant)]],\n0)","v":0},{"$f":"IFERROR(\nCountyScoresTbl[[#This Row],[Affordable Single Family Homes Sold In Last Year (November 2024)\n(Zillow.com)]]/CountyScoresTbl[[#This Row],[Serna Proposed Number of Loans (entered by Applicant)]],\n0)","v":0},2,2,{"$f":"MIN(CountyScoresTbl[[#This Row],[Median Owner Renter Cost Ratio Points]]+CountyScoresTbl[[#This Row],[CalHome Proposed Loans to Sales Ratio Points]],15)","v":6},{"$f":"MIN(CountyScoresTbl[[#This Row],[Median Owner Renter Cost Ratio Points]]+CountyScoresTbl[[#This Row],[Serna Proposed Loans to Sales Ratio Points]],15)","v":6},0.72842121782799751,6,6.0313630880579009E-3,4,{"$f":"MIN(SUM(CountyScoresTbl[[#This Row],[Points Awarded10]],CountyScoresTbl[[#This Row],[Points Awarded12]]),15)","v":10},0.36964504283965727,4,3.5965598123534011E-2,4,{"$f":"MIN(SUM(CountyScoresTbl[[#This Row],[Points Awarded11]],CountyScoresTbl[[#This Row],[Points Awarded13]]),15)","v":8},1.6025056947608201,3,{"$f":"SUM(CountyScoresTbl[[#This Row],[Points Awarded5]],10)","v":13},0,{"$f":"IF(CountyScoresTbl[[#This Row],[OMS Migrant Family Housing Centers In County]]>=3,30,IF(CountyScoresTbl[[#This Row],[OMS Migrant Family Housing Centers In County]]=2,20,IF(CountyScoresTbl[[#This Row],[OMS Migrant Family Housing Centers In County]]=1,10,0)))","v":0}]
["Solano",5.3268551236749113,3,0.53985066851884012,1,3.6204202118423338E-2,3,3.0797711208347359E-2,3,{"$f":"MIN(SUM(CountyScoresTbl[[#This Row],[Points Awarded]],CountyScoresTbl[[#This Row],[Points Awarded2]],CountyScoresTbl[[#This Row],[Points Awarded3]],CountyScoresTbl[[#This Row],[Points Awarded4]]),15)","v":10},null,null,3.4334822587476603E-2,4,null,null,0.28139316951270305,2,{"$f":"MIN(SUM(CountyScoresTbl[[#This Row],[Points Awarded6]],CountyScoresTbl[[#This Row],[Points Awarded7]],CountyScoresTbl[[#This Row],[Points Awarded8]],CountyScoresTbl[[#This Row],[Points Awarded9]]),15)","v":6},1.2942958101968702,8,602000,595988,586183.79960426397,{"$f":"MIN(\n500000,\nAVERAGE(CountyScoresTbl[[#This Row],[Redfin.com \nMedian Sales Price (October 2024)]:[Zillow.com Median Sales Price (October 2024)]]))","v":500000},1433,{"$f":"'HDPL Unit Mix'!$G$16","v":0},{"$f":"'HDPL Unit Mix'!$H$16","v":0},{"$f":"IFERROR(\nCountyScoresTbl[[#This Row],[Affordable Single Family Homes Sold In Last Year (November 2024)\n(Zillow.com)]]/CountyScoresTbl[[#This Row],[CalHome Proposed Number of Loans (entered by Applicant)]],\n0)","v":0},{"$f":"IFERROR(\nCountyScoresTbl[[#This Row],[Affordable Single Family Homes Sold In Last Year (November 2024)\n(Zillow.com)]]/CountyScoresTbl[[#This Row],[Serna Proposed Number of Loans (entered by Applicant)]],\n0)","v":0},2,2,{"$f":"MIN(CountyScoresTbl[[#This Row],[Median Owner Renter Cost Ratio Points]]+CountyScoresTbl[[#This Row],[CalHome Proposed Loans to Sales Ratio Points]],15)","v":10},{"$f":"MIN(CountyScoresTbl[[#This Row],[Median Owner Renter Cost Ratio Points]]+CountyScoresTbl[[#This Row],[Serna Proposed Loans to Sales Ratio Points]],15)","v":10},0.65356426319452976,6,7.8092461474385672E-3,6,{"$f":"MIN(SUM(CountyScoresTbl[[#This Row],[Points Awarded10]],CountyScoresTbl[[#This Row],[Points Awarded12]]),15)","v":12},0.43920874879382438,8,3.0797711208347359E-2,6,{"$f":"MIN(SUM(CountyScoresTbl[[#This Row],[Points Awarded11]],CountyScoresTbl[[#This Row],[Points Awarded13]]),15)","v":14},1.3271971496437054,5,{"$f":"SUM(CountyScoresTbl[[#This Row],[Points Awarded5]],10)","v":15},2,{"$f":"IF(CountyScoresTbl[[#This Row],[OMS Migrant Family Housing Centers In County]]>=3,30,IF(CountyScoresTbl[[#This Row],[OMS Migrant Family Housing Centers In County]]=2,20,IF(CountyScoresTbl[[#This Row],[OMS Migrant Family Housing Centers In County]]=1,10,0)))","v":20}]
["Sonoma",6.4385514018691588,3,0.56287301913974064,2,2.8949715304932427E-2,2,3.0204244561240105E-2,3,{"$f":"MIN(SUM(CountyScoresTbl[[#This Row],[Points Awarded]],CountyScoresTbl[[#This Row],[Points Awarded2]],CountyScoresTbl[[#This Row],[Points Awarded3]],CountyScoresTbl[[#This Row],[Points Awarded4]]),15)","v":10},null,null,2.7243745741263505E-2,2,null,null,0.30050450605838469,4,{"$f":"MIN(SUM(CountyScoresTbl[[#This Row],[Points Awarded6]],CountyScoresTbl[[#This Row],[Points Awarded7]],CountyScoresTbl[[#This Row],[Points Awarded8]],CountyScoresTbl[[#This Row],[Points Awarded9]]),15)","v":6},1.4366683095120749,8,819500,1018498,791146.35289602994,{"$f":"MIN(\n500000,\nAVERAGE(CountyScoresTbl[[#This Row],[Redfin.com \nMedian Sales Price (October 2024)]:[Zillow.com Median Sales Price (October 2024)]]))","v":500000},1090,{"$f":"'HDPL Unit Mix'!$G$16","v":0},{"$f":"'HDPL Unit Mix'!$H$16","v":0},{"$f":"IFERROR(\nCountyScoresTbl[[#This Row],[Affordable Single Family Homes Sold In Last Year (November 2024)\n(Zillow.com)]]/CountyScoresTbl[[#This Row],[CalHome Proposed Number of Loans (entered by Applicant)]],\n0)","v":0},{"$f":"IFERROR(\nCountyScoresTbl[[#This Row],[Affordable Single Family Homes Sold In Last Year (November 2024)\n(Zillow.com)]]/CountyScoresTbl[[#This Row],[Serna Proposed Number of Loans (entered by Applicant)]],\n0)","v":0},2,2,{"$f":"MIN(CountyScoresTbl[[#This Row],[Median Owner Renter Cost Ratio Points]]+CountyScoresTbl[[#This Row],[CalHome Proposed Loans to Sales Ratio Points]],15)","v":10},{"$f":"MIN(CountyScoresTbl[[#This Row],[Median Owner Renter Cost Ratio Points]]+CountyScoresTbl[[#This Row],[Serna Proposed Loans to Sales Ratio Points]],15)","v":10},0.72735436747889604,6,6.6836272691992585E-3,4,{"$f":"MIN(SUM(CountyScoresTbl[[#This Row],[Points Awarded10]],CountyScoresTbl[[#This Row],[Points Awarded12]]),15)","v":10},0.41389396709323584,6,3.0204244561240105E-2,6,{"$f":"MIN(SUM(CountyScoresTbl[[#This Row],[Points Awarded11]],CountyScoresTbl[[#This Row],[Points Awarded13]]),15)","v":12},1.4779116465863453,4,{"$f":"SUM(CountyScoresTbl[[#This Row],[Points Awarded5]],10)","v":14},0,{"$f":"IF(CountyScoresTbl[[#This Row],[OMS Migrant Family Housing Centers In County]]>=3,30,IF(CountyScoresTbl[[#This Row],[OMS Migrant Family Housing Centers In County]]=2,20,IF(CountyScoresTbl[[#This Row],[OMS Migrant Family Housing Centers In County]]=1,10,0)))","v":0}]
["Stanislaus",5.2375809935205186,2,0.54915660949961187,1,2.703084197896817E-2,2,2.5515818431911967E-2,4,{"$f":"MIN(SUM(CountyScoresTbl[[#This Row],[Points Awarded]],CountyScoresTbl[[#This Row],[Points Awarded2]],CountyScoresTbl[[#This Row],[Points Awarded3]],CountyScoresTbl[[#This Row],[Points Awarded4]]),15)","v":9},null,null,4.5363631982264209E-2,6,null,null,0.28185568988677795,2,{"$f":"MIN(SUM(CountyScoresTbl[[#This Row],[Points Awarded6]],CountyScoresTbl[[#This Row],[Points Awarded7]],CountyScoresTbl[[#This Row],[Points Awarded8]],CountyScoresTbl[[#This Row],[Points Awarded9]]),15)","v":8},1.4019539427773902,8,480000,524950,463389.13511558599,{"$f":"MIN(\n500000,\nAVERAGE(CountyScoresTbl[[#This Row],[Redfin.com \nMedian Sales Price (October 2024)]:[Zillow.com Median Sales Price (October 2024)]]))","v":489446.378371862},2841,{"$f":"'HDPL Unit Mix'!$G$16","v":0},{"$f":"'HDPL Unit Mix'!$H$16","v":0},{"$f":"IFERROR(\nCountyScoresTbl[[#This Row],[Affordable Single Family Homes Sold In Last Year (November 2024)\n(Zillow.com)]]/CountyScoresTbl[[#This Row],[CalHome Proposed Number of Loans (entered by Applicant)]],\n0)","v":0},{"$f":"IFERROR(\nCountyScoresTbl[[#This Row],[Affordable Single Family Homes Sold In Last Year (November 2024)\n(Zillow.com)]]/CountyScoresTbl[[#This Row],[Serna Proposed Number of Loans (entered by Applicant)]],\n0)","v":0},2,2,{"$f":"MIN(CountyScoresTbl[[#This Row],[Median Owner Renter Cost Ratio Points]]+CountyScoresTbl[[#This Row],[CalHome Proposed Loans to Sales Ratio Points]],15)","v":10},{"$f":"MIN(CountyScoresTbl[[#This Row],[Median Owner Renter Cost Ratio Points]]+CountyScoresTbl[[#This Row],[Serna Proposed Loans to Sales Ratio Points]],15)","v":10},0.61217198356509561,4,1.2521588946459413E-2,8,{"$f":"MIN(SUM(CountyScoresTbl[[#This Row],[Points Awarded10]],CountyScoresTbl[[#This Row],[Points Awarded12]]),15)","v":12},0.44480143940367561,8,2.5515818431911967E-2,8,{"$f":"MIN(SUM(CountyScoresTbl[[#This Row],[Points Awarded11]],CountyScoresTbl[[#This Row],[Points Awarded13]]),15)","v":15},1.431404958677686,5,{"$f":"SUM(CountyScoresTbl[[#This Row],[Points Awarded5]],10)","v":15},3,{"$f":"IF(CountyScoresTbl[[#This Row],[OMS Migrant Family Housing Centers In County]]>=3,30,IF(CountyScoresTbl[[#This Row],[OMS Migrant Family Housing Centers In County]]=2,20,IF(CountyScoresTbl[[#This Row],[OMS Migrant Family Housing Centers In County]]=1,10,0)))","v":30}]
["Sutter",4.9943117178612058,2,0.53866666666666663,1,2.4380952380952382E-2,2,3.1722611582441905E-2,3,{"$f":"MIN(SUM(CountyScoresTbl[[#This Row],[Points Awarded]],CountyScoresTbl[[#This Row],[Points Awarded2]],CountyScoresTbl[[#This Row],[Points Awarded3]],CountyScoresTbl[[#This Row],[Points Awarded4]]),15)","v":8},null,null,4.2967166599108229E-2,4,null,null,0.25459652706843716,2,{"$f":"MIN(SUM(CountyScoresTbl[[#This Row],[Points Awarded6]],CountyScoresTbl[[#This Row],[Points Awarded7]],CountyScoresTbl[[#This Row],[Points Awarded8]],CountyScoresTbl[[#This Row],[Points Awarded9]]),15)","v":6},1.5027152831652444,6,434500,485000,432014.46201840497,{"$f":"MIN(\n500000,\nAVERAGE(CountyScoresTbl[[#This Row],[Redfin.com \nMedian Sales Price (October 2024)]:[Zillow.com Median Sales Price (October 2024)]]))","v":450504.8206728017},508,{"$f":"'HDPL Unit Mix'!$G$16","v":0},{"$f":"'HDPL Unit Mix'!$H$16","v":0},{"$f":"IFERROR(\nCountyScoresTbl[[#This Row],[Affordable Single Family Homes Sold In Last Year (November 2024)\n(Zillow.com)]]/CountyScoresTbl[[#This Row],[CalHome Proposed Number of Loans (entered by Applicant)]],\n0)","v":0},{"$f":"IFERROR(\nCountyScoresTbl[[#This Row],[Affordable Single Family Homes Sold In Last Year (November 2024)\n(Zillow.com)]]/CountyScoresTbl[[#This Row],[Serna Proposed Number of Loans (entered by Applicant)]],\n0)","v":0},2,2,{"$f":"MIN(CountyScoresTbl[[#This Row],[Median Owner Renter Cost Ratio Points]]+CountyScoresTbl[[#This Row],[CalHome Proposed Loans to Sales Ratio Points]],15)","v":8},{"$f":"MIN(CountyScoresTbl[[#This Row],[Median Owner Renter Cost Ratio Points]]+CountyScoresTbl[[#This Row],[Serna Proposed Loans to Sales Ratio Points]],15)","v":8},0.56087398373983743,2,1.2768130745658836E-2,8,{"$f":"MIN(SUM(CountyScoresTbl[[#This Row],[Points Awarded10]],CountyScoresTbl[[#This Row],[Points Awarded12]]),15)","v":10},0.32885431400282883,2,3.1722611582441905E-2,6,{"$f":"MIN(SUM(CountyScoresTbl[[#This Row],[Points Awarded11]],CountyScoresTbl[[#This Row],[Points Awarded13]]),15)","v":8},1.5707762557077625,3,{"$f":"SUM(CountyScoresTbl[[#This Row],[Points Awarded5]],10)","v":13},1,{"$f":"IF(CountyScoresTbl[[#This Row],[OMS Migrant Family Housing Centers In County]]>=3,30,IF(CountyScoresTbl[[#This Row],[OMS Migrant Family Housing Centers In County]]=2,20,IF(CountyScoresTbl[[#This Row],[OMS Migrant Family Housing Centers In County]]=1,10,0)))","v":10}]
["Tehama",3.9249146757679183,1,0.65797641216635627,4,1.11731843575419E-2,1,0,4,{"$f":"MIN(SUM(CountyScoresTbl[[#This Row],[Points Awarded]],CountyScoresTbl[[#This Row],[Points Awarded2]],CountyScoresTbl[[#This Row],[Points Awarded3]],CountyScoresTbl[[#This Row],[Points Awarded4]]),15)","v":10},null,null,5.0673068678727604E-2,6,null,null,0.38344953016065475,8,{"$f":"MIN(SUM(CountyScoresTbl[[#This Row],[Points Awarded6]],CountyScoresTbl[[#This Row],[Points Awarded7]],CountyScoresTbl[[#This Row],[Points Awarded8]],CountyScoresTbl[[#This Row],[Points Awarded9]]),15)","v":14},1.4647006255585344,6,325000,420000,313509.97750516603,{"$f":"MIN(\n500000,\nAVERAGE(CountyScoresTbl[[#This Row],[Redfin.com \nMedian Sales Price (October 2024)]:[Zillow.com Median Sales Price (October 2024)]]))","v":352836.65916838869},578,{"$f":"'HDPL Unit Mix'!$G$16","v":0},{"$f":"'HDPL Unit Mix'!$H$16","v":0},{"$f":"IFERROR(\nCountyScoresTbl[[#This Row],[Affordable Single Family Homes Sold In Last Year (November 2024)\n(Zillow.com)]]/CountyScoresTbl[[#This Row],[CalHome Proposed Number of Loans (entered by Applicant)]],\n0)","v":0},{"$f":"IFERROR(\nCountyScoresTbl[[#This Row],[Affordable Single Family Homes Sold In Last Year (November 2024)\n(Zillow.com)]]/CountyScoresTbl[[#This Row],[Serna Proposed Number of Loans (entered by Applicant)]],\n0)","v":0},2,2,{"$f":"MIN(CountyScoresTbl[[#This Row],[Median Owner Renter Cost Ratio Points]]+CountyScoresTbl[[#This Row],[CalHome Proposed Loans to Sales Ratio Points]],15)","v":8},{"$f":"MIN(CountyScoresTbl[[#This Row],[Median Owner Renter Cost Ratio Points]]+CountyScoresTbl[[#This Row],[Serna Proposed Loans to Sales Ratio Points]],15)","v":8},0.5932808716707022,4,1.6671718702637162E-2,8,{"$f":"MIN(SUM(CountyScoresTbl[[#This Row],[Points Awarded10]],CountyScoresTbl[[#This Row],[Points Awarded12]]),15)","v":12},0.37830188679245286,4,0,8,{"$f":"MIN(SUM(CountyScoresTbl[[#This Row],[Points Awarded11]],CountyScoresTbl[[#This Row],[Points Awarded13]]),15)","v":12},1.4866255144032923,4,{"$f":"SUM(CountyScoresTbl[[#This Row],[Points Awarded5]],10)","v":14},0,{"$f":"IF(CountyScoresTbl[[#This Row],[OMS Migrant Family Housing Centers In County]]>=3,30,IF(CountyScoresTbl[[#This Row],[OMS Migrant Family Housing Centers In County]]=2,20,IF(CountyScoresTbl[[#This Row],[OMS Migrant Family Housing Centers In County]]=1,10,0)))","v":0}]
["Trinity",2.3321956769055747,1,0.74846625766871167,4,0,1,1.2121212121212121E-2,4,{"$f":"MIN(SUM(CountyScoresTbl[[#This Row],[Points Awarded]],CountyScoresTbl[[#This Row],[Points Awarded2]],CountyScoresTbl[[#This Row],[Points Awarded3]],CountyScoresTbl[[#This Row],[Points Awarded4]]),15)","v":10},null,null,5.2857142857142859E-2,6,null,null,0.48963730569948188,8,{"$f":"MIN(SUM(CountyScoresTbl[[#This Row],[Points Awarded6]],CountyScoresTbl[[#This Row],[Points Awarded7]],CountyScoresTbl[[#This Row],[Points Awarded8]],CountyScoresTbl[[#This Row],[Points Awarded9]]),15)","v":14},1.90625,2,197500,425000,280584.90213986498,{"$f":"MIN(\n500000,\nAVERAGE(CountyScoresTbl[[#This Row],[Redfin.com \nMedian Sales Price (October 2024)]:[Zillow.com Median Sales Price (October 2024)]]))","v":301028.30071328831},181,{"$f":"'HDPL Unit Mix'!$G$16","v":0},{"$f":"'HDPL Unit Mix'!$H$16","v":0},{"$f":"IFERROR(\nCountyScoresTbl[[#This Row],[Affordable Single Family Homes Sold In Last Year (November 2024)\n(Zillow.com)]]/CountyScoresTbl[[#This Row],[CalHome Proposed Number of Loans (entered by Applicant)]],\n0)","v":0},{"$f":"IFERROR(\nCountyScoresTbl[[#This Row],[Affordable Single Family Homes Sold In Last Year (November 2024)\n(Zillow.com)]]/CountyScoresTbl[[#This Row],[Serna Proposed Number of Loans (entered by Applicant)]],\n0)","v":0},2,2,{"$f":"MIN(CountyScoresTbl[[#This Row],[Median Owner Renter Cost Ratio Points]]+CountyScoresTbl[[#This Row],[CalHome Proposed Loans to Sales Ratio Points]],15)","v":4},{"$f":"MIN(CountyScoresTbl[[#This Row],[Median Owner Renter Cost Ratio Points]]+CountyScoresTbl[[#This Row],[Serna Proposed Loans to Sales Ratio Points]],15)","v":4},0.75972186453772861,8,5.1813471502590676E-3,4,{"$f":"MIN(SUM(CountyScoresTbl[[#This Row],[Points Awarded10]],CountyScoresTbl[[#This Row],[Points Awarded12]]),15)","v":12},0.21311475409836064,2,1.2121212121212121E-2,8,{"$f":"MIN(SUM(CountyScoresTbl[[#This Row],[Points Awarded11]],CountyScoresTbl[[#This Row],[Points Awarded13]]),15)","v":10},1.8019680196801968,1,{"$f":"SUM(CountyScoresTbl[[#This Row],[Points Awarded5]],10)","v":11},0,{"$f":"IF(CountyScoresTbl[[#This Row],[OMS Migrant Family Housing Centers In County]]>=3,30,IF(CountyScoresTbl[[#This Row],[OMS Migrant Family Housing Centers In County]]=2,20,IF(CountyScoresTbl[[#This Row],[OMS Migrant Family Housing Centers In County]]=1,10,0)))","v":0}]
["Tulare",4.4567690557451654,1,0.64187883371145282,4,3.7559868918578272E-2,3,2.1862414728363606E-2,4,{"$f":"MIN(SUM(CountyScoresTbl[[#This Row],[Points Awarded]],CountyScoresTbl[[#This Row],[Points Awarded2]],CountyScoresTbl[[#This Row],[Points Awarded3]],CountyScoresTbl[[#This Row],[Points Awarded4]]),15)","v":12},null,null,7.2737520374122205E-2,8,null,null,0.33335413416536663,6,{"$f":"MIN(SUM(CountyScoresTbl[[#This Row],[Points Awarded6]],CountyScoresTbl[[#This Row],[Points Awarded7]],CountyScoresTbl[[#This Row],[Points Awarded8]],CountyScoresTbl[[#This Row],[Points Awarded9]]),15)","v":14},1.4951627088830255,6,391565,419900,344877.00398836198,{"$f":"MIN(\n500000,\nAVERAGE(CountyScoresTbl[[#This Row],[Redfin.com \nMedian Sales Price (October 2024)]:[Zillow.com Median Sales Price (October 2024)]]))","v":385447.33466278733},2372,{"$f":"'HDPL Unit Mix'!$G$16","v":0},{"$f":"'HDPL Unit Mix'!$H$16","v":0},{"$f":"IFERROR(\nCountyScoresTbl[[#This Row],[Affordable Single Family Homes Sold In Last Year (November 2024)\n(Zillow.com)]]/CountyScoresTbl[[#This Row],[CalHome Proposed Number of Loans (entered by Applicant)]],\n0)","v":0},{"$f":"IFERROR(\nCountyScoresTbl[[#This Row],[Affordable Single Family Homes Sold In Last Year (November 2024)\n(Zillow.com)]]/CountyScoresTbl[[#This Row],[Serna Proposed Number of Loans (entered by Applicant)]],\n0)","v":0},2,2,{"$f":"MIN(CountyScoresTbl[[#This Row],[Median Owner Renter Cost Ratio Points]]+CountyScoresTbl[[#This Row],[CalHome Proposed Loans to Sales Ratio Points]],15)","v":8},{"$f":"MIN(CountyScoresTbl[[#This Row],[Median Owner Renter Cost Ratio Points]]+CountyScoresTbl[[#This Row],[Serna Proposed Loans to Sales Ratio Points]],15)","v":8},0.56432905285216506,2,1.4290171606864275E-2,8,{"$f":"MIN(SUM(CountyScoresTbl[[#This Row],[Points Awarded10]],CountyScoresTbl[[#This Row],[Points Awarded12]]),15)","v":10},0.35685299122921849,4,2.1862414728363606E-2,8,{"$f":"MIN(SUM(CountyScoresTbl[[#This Row],[Points Awarded11]],CountyScoresTbl[[#This Row],[Points Awarded13]]),15)","v":12},1.517453798767967,4,{"$f":"SUM(CountyScoresTbl[[#This Row],[Points Awarded5]],10)","v":14},0,{"$f":"IF(CountyScoresTbl[[#This Row],[OMS Migrant Family Housing Centers In County]]>=3,30,IF(CountyScoresTbl[[#This Row],[OMS Migrant Family Housing Centers In County]]=2,20,IF(CountyScoresTbl[[#This Row],[OMS Migrant Family Housing Centers In County]]=1,10,0)))","v":0}]
["Tuolumne",4.3500511770726717,1,0.6446917808219178,4,2.3116438356164382E-2,2,6.4102564102564097E-2,1,{"$f":"MIN(SUM(CountyScoresTbl[[#This Row],[Points Awarded]],CountyScoresTbl[[#This Row],[Points Awarded2]],CountyScoresTbl[[#This Row],[Points Awarded3]],CountyScoresTbl[[#This Row],[Points Awarded4]]),15)","v":8},null,null,3.8698977241315768E-2,4,null,null,0.28128621089223638,2,{"$f":"MIN(SUM(CountyScoresTbl[[#This Row],[Points Awarded6]],CountyScoresTbl[[#This Row],[Points Awarded7]],CountyScoresTbl[[#This Row],[Points Awarded8]],CountyScoresTbl[[#This Row],[Points Awarded9]]),15)","v":6},1.9034543844109832,2,405000,454500,395900.25872193201,{"$f":"MIN(\n500000,\nAVERAGE(CountyScoresTbl[[#This Row],[Redfin.com \nMedian Sales Price (October 2024)]:[Zillow.com Median Sales Price (October 2024)]]))","v":418466.75290731067},942,{"$f":"'HDPL Unit Mix'!$G$16","v":0},{"$f":"'HDPL Unit Mix'!$H$16","v":0},{"$f":"IFERROR(\nCountyScoresTbl[[#This Row],[Affordable Single Family Homes Sold In Last Year (November 2024)\n(Zillow.com)]]/CountyScoresTbl[[#This Row],[CalHome Proposed Number of Loans (entered by Applicant)]],\n0)","v":0},{"$f":"IFERROR(\nCountyScoresTbl[[#This Row],[Affordable Single Family Homes Sold In Last Year (November 2024)\n(Zillow.com)]]/CountyScoresTbl[[#This Row],[Serna Proposed Number of Loans (entered by Applicant)]],\n0)","v":0},2,2,{"$f":"MIN(CountyScoresTbl[[#This Row],[Median Owner Renter Cost Ratio Points]]+CountyScoresTbl[[#This Row],[CalHome Proposed Loans to Sales Ratio Points]],15)","v":4},{"$f":"MIN(CountyScoresTbl[[#This Row],[Median Owner Renter Cost Ratio Points]]+CountyScoresTbl[[#This Row],[Serna Proposed Loans to Sales Ratio Points]],15)","v":4},0.70496145017950684,6,1.1587485515643105E-3,2,{"$f":"MIN(SUM(CountyScoresTbl[[#This Row],[Points Awarded10]],CountyScoresTbl[[#This Row],[Points Awarded12]]),15)","v":8},0.38778220451527223,4,6.4102564102564097E-2,2,{"$f":"MIN(SUM(CountyScoresTbl[[#This Row],[Points Awarded11]],CountyScoresTbl[[#This Row],[Points Awarded13]]),15)","v":6},1.7951219512195122,1,{"$f":"SUM(CountyScoresTbl[[#This Row],[Points Awarded5]],10)","v":11},0,{"$f":"IF(CountyScoresTbl[[#This Row],[OMS Migrant Family Housing Centers In County]]>=3,30,IF(CountyScoresTbl[[#This Row],[OMS Migrant Family Housing Centers In County]]=2,20,IF(CountyScoresTbl[[#This Row],[OMS Migrant Family Housing Centers In County]]=1,10,0)))","v":0}]
["Ventura",7.484076433121019,3,0.61938546090432178,3,4.4316762428178863E-2,4,3.9356851451883848E-2,2,{"$f":"MIN(SUM(CountyScoresTbl[[#This Row],[Points Awarded]],CountyScoresTbl[[#This Row],[Points Awarded2]],CountyScoresTbl[[#This Row],[Points Awarded3]],CountyScoresTbl[[#This Row],[Points Awarded4]]),15)","v":12},null,null,2.7927548129904518E-2,2,null,null,0.33283637718971298,6,{"$f":"MIN(SUM(CountyScoresTbl[[#This Row],[Points Awarded6]],CountyScoresTbl[[#This Row],[Points Awarded7]],CountyScoresTbl[[#This Row],[Points Awarded8]],CountyScoresTbl[[#This Row],[Points Awarded9]]),15)","v":8},1.3738317757009346,8,937000,999125,862873.52334515098,{"$f":"MIN(\n500000,\nAVERAGE(CountyScoresTbl[[#This Row],[Redfin.com \nMedian Sales Price (October 2024)]:[Zillow.com Median Sales Price (October 2024)]]))","v":500000},923,{"$f":"'HDPL Unit Mix'!$G$16","v":0},{"$f":"'HDPL Unit Mix'!$H$16","v":0},{"$f":"IFERROR(\nCountyScoresTbl[[#This Row],[Affordable Single Family Homes Sold In Last Year (November 2024)\n(Zillow.com)]]/CountyScoresTbl[[#This Row],[CalHome Proposed Number of Loans (entered by Applicant)]],\n0)","v":0},{"$f":"IFERROR(\nCountyScoresTbl[[#This Row],[Affordable Single Family Homes Sold In Last Year (November 2024)\n(Zillow.com)]]/CountyScoresTbl[[#This Row],[Serna Proposed Number of Loans (entered by Applicant)]],\n0)","v":0},2,2,{"$f":"MIN(CountyScoresTbl[[#This Row],[Median Owner Renter Cost Ratio Points]]+CountyScoresTbl[[#This Row],[CalHome Proposed Loans to Sales Ratio Points]],15)","v":10},{"$f":"MIN(CountyScoresTbl[[#This Row],[Median Owner Renter Cost Ratio Points]]+CountyScoresTbl[[#This Row],[Serna Proposed Loans to Sales Ratio Points]],15)","v":10},0.75177120203879366,8,6.5655552051377616E-3,4,{"$f":"MIN(SUM(CountyScoresTbl[[#This Row],[Points Awarded10]],CountyScoresTbl[[#This Row],[Points Awarded12]]),15)","v":12},0.4207469549084456,6,3.9356851451883848E-2,4,{"$f":"MIN(SUM(CountyScoresTbl[[#This Row],[Points Awarded11]],CountyScoresTbl[[#This Row],[Points Awarded13]]),15)","v":10},1.4039913700107876,5,{"$f":"SUM(CountyScoresTbl[[#This Row],[Points Awarded5]],10)","v":15},0,{"$f":"IF(CountyScoresTbl[[#This Row],[OMS Migrant Family Housing Centers In County]]>=3,30,IF(CountyScoresTbl[[#This Row],[OMS Migrant Family Housing Centers In County]]=2,20,IF(CountyScoresTbl[[#This Row],[OMS Migrant Family Housing Centers In County]]=1,10,0)))","v":0}]
["Yolo",5.2350427350427351,2,0.63697502058742794,3,3.4586878945923688E-2,3,2.5414660246120921E-2,4,{"$f":"MIN(SUM(CountyScoresTbl[[#This Row],[Points Awarded]],CountyScoresTbl[[#This Row],[Points Awarded2]],CountyScoresTbl[[#This Row],[Points Awarded3]],CountyScoresTbl[[#This Row],[Points Awarded4]]),15)","v":12},null,null,3.3012512030798843E-2,2,null,null,0.21542008196721313,2,{"$f":"MIN(SUM(CountyScoresTbl[[#This Row],[Points Awarded6]],CountyScoresTbl[[#This Row],[Points Awarded7]],CountyScoresTbl[[#This Row],[Points Awarded8]],CountyScoresTbl[[#This Row],[Points Awarded9]]),15)","v":4},1.5154078549848942,6,615000,646000,608562.27611998003,{"$f":"MIN(\n500000,\nAVERAGE(CountyScoresTbl[[#This Row],[Redfin.com \nMedian Sales Price (October 2024)]:[Zillow.com Median Sales Price (October 2024)]]))","v":500000},537,{"$f":"'HDPL Unit Mix'!$G$16","v":0},{"$f":"'HDPL Unit Mix'!$H$16","v":0},{"$f":"IFERROR(\nCountyScoresTbl[[#This Row],[Affordable Single Family Homes Sold In Last Year (November 2024)\n(Zillow.com)]]/CountyScoresTbl[[#This Row],[CalHome Proposed Number of Loans (entered by Applicant)]],\n0)","v":0},{"$f":"IFERROR(\nCountyScoresTbl[[#This Row],[Affordable Single Family Homes Sold In Last Year (November 2024)\n(Zillow.com)]]/CountyScoresTbl[[#This Row],[Serna Proposed Number of Loans (entered by Applicant)]],\n0)","v":0},2,2,{"$f":"MIN(CountyScoresTbl[[#This Row],[Median Owner Renter Cost Ratio Points]]+CountyScoresTbl[[#This Row],[CalHome Proposed Loans to Sales Ratio Points]],15)","v":8},{"$f":"MIN(CountyScoresTbl[[#This Row],[Median Owner Renter Cost Ratio Points]]+CountyScoresTbl[[#This Row],[Serna Proposed Loans to Sales Ratio Points]],15)","v":8},0.57798650282030617,4,3.329918032786885E-3,2,{"$f":"MIN(SUM(CountyScoresTbl[[#This Row],[Points Awarded10]],CountyScoresTbl[[#This Row],[Points Awarded12]]),15)","v":6},0.44171514759750052,8,2.5414660246120921E-2,8,{"$f":"MIN(SUM(CountyScoresTbl[[#This Row],[Points Awarded11]],CountyScoresTbl[[#This Row],[Points Awarded13]]),15)","v":15},1.6544923301680059,2,{"$f":"SUM(CountyScoresTbl[[#This Row],[Points Awarded5]],10)","v":12},1,{"$f":"IF(CountyScoresTbl[[#This Row],[OMS Migrant Family Housing Centers In County]]>=3,30,IF(CountyScoresTbl[[#This Row],[OMS Migrant Family Housing Centers In County]]=2,20,IF(CountyScoresTbl[[#This Row],[OMS Migrant Family Housing Centers In County]]=1,10,0)))","v":10}]
["Yuba",4.9558589306029583,2,0.59341723136495639,2,2.9525653436592449E-2,2,3.4128097241701731E-2,3,{"$f":"MIN(SUM(CountyScoresTbl[[#This Row],[Points Awarded]],CountyScoresTbl[[#This Row],[Points Awarded2]],CountyScoresTbl[[#This Row],[Points Awarded3]],CountyScoresTbl[[#This Row],[Points Awarded4]]),15)","v":9},null,null,4.8827972899306911E-2,6,null,null,0.31259438236182424,4,{"$f":"MIN(SUM(CountyScoresTbl[[#This Row],[Points Awarded6]],CountyScoresTbl[[#This Row],[Points Awarded7]],CountyScoresTbl[[#This Row],[Points Awarded8]],CountyScoresTbl[[#This Row],[Points Awarded9]]),15)","v":10},1.7880386983289358,2,436000,481450,412698.95547179901,{"$f":"MIN(\n500000,\nAVERAGE(CountyScoresTbl[[#This Row],[Redfin.com \nMedian Sales Price (October 2024)]:[Zillow.com Median Sales Price (October 2024)]]))","v":443382.98515726632},583,{"$f":"'HDPL Unit Mix'!$G$16","v":0},{"$f":"'HDPL Unit Mix'!$H$16","v":0},{"$f":"IFERROR(\nCountyScoresTbl[[#This Row],[Affordable Single Family Homes Sold In Last Year (November 2024)\n(Zillow.com)]]/CountyScoresTbl[[#This Row],[CalHome Proposed Number of Loans (entered by Applicant)]],\n0)","v":0},{"$f":"IFERROR(\nCountyScoresTbl[[#This Row],[Affordable Single Family Homes Sold In Last Year (November 2024)\n(Zillow.com)]]/CountyScoresTbl[[#This Row],[Serna Proposed Number of Loans (entered by Applicant)]],\n0)","v":0},2,2,{"$f":"MIN(CountyScoresTbl[[#This Row],[Median Owner Renter Cost Ratio Points]]+CountyScoresTbl[[#This Row],[CalHome Proposed Loans to Sales Ratio Points]],15)","v":4},{"$f":"MIN(CountyScoresTbl[[#This Row],[Median Owner Renter Cost Ratio Points]]+CountyScoresTbl[[#This Row],[Serna Proposed Loans to Sales Ratio Points]],15)","v":4},0.49781427221172025,2,3.3222591362126247E-3,2,{"$f":"MIN(SUM(CountyScoresTbl[[#This Row],[Points Awarded10]],CountyScoresTbl[[#This Row],[Points Awarded12]]),15)","v":4},0.35562805872756931,4,3.4128097241701731E-2,6,{"$f":"MIN(SUM(CountyScoresTbl[[#This Row],[Points Awarded11]],CountyScoresTbl[[#This Row],[Points Awarded13]]),15)","v":10},1.7320197044334975,1,{"$f":"SUM(CountyScoresTbl[[#This Row],[Points Awarded5]],10)","v":11},0,{"$f":"IF(CountyScoresTbl[[#This Row],[OMS Migrant Family Housing Centers In County]]>=3,30,IF(CountyScoresTbl[[#This Row],[OMS Migrant Family Housing Centers In County]]=2,20,IF(CountyScoresTbl[[#This Row],[OMS Migrant Family Housing Centers In County]]=1,10,0)))","v":0}]

{"sheet":"Cover Page","index":3,"n_rows":35,"n_cols":9,"rows_kept":35,"cut":false,"hidden":false,"merged":[[33,8,33,9],[32,3,32,5],[33,2,33,7],[34,2,34,7],[34,8,34,9]]}
[]
[]
[null,"CalHome And FWHG Home Ownership Programs"]
[null,"2024 Homeownership Super Notice of Funding Availability (Super NOFA)\n(December 12, 2024)"]
[null,"2024 CalHome Tribal Notice of Funding Availability (NOFA)\n(December 12, 2024)"]
[null,"Application"]
[]
[]
[]
[]
[]
[]
[]
[]
[]
[]
[]
[]
[null,"State of California"]
[null,"Gavin Newsom, Governor "]
[]
[null,"Business, Consumer Services and Housing Agency"]
[null,"Tomiquia Moss, Secretary"]
[null,"https://www.bcsh.ca.gov/"]
[]
[null,"Department of Housing and Community Development (HCD)"]
[null,"Gustavo Velasquez, Director"]
[null,"2020 West El Camino Avenue, Suite 150, Sacramento, CA 95833"]
[null,"HOSN@hcd.ca.gov"]
[null,"Homeownership Super NOFA"]
[]
[null,"End of Document"]
[null,null," V1",45609]
[null,null,"HOSN App due date:",null,null,null,null,null,"2025-02-13"]
[null,null,"Tribal App due date:",null,null,null,null,null,"2025-03-13"]

{"sheet":"Instructions","index":4,"n_rows":21,"n_cols":29,"rows_kept":21,"cut":false,"hidden":false,"merged":[[7,1,7,38],[1,1,1,38],[3,1,3,38],[12,28,12,38],[4,5,4,38],[8,1,8,38],[9,1,9,23],[9,24,9,38],[20,1,20,38],[11,1,11,38],[18,1,18,38],[10,1,10,38],[14,1,14,4],[14,5,14,38],[15,1,15,4],[15,5,15,38],[16,1,16,4],[16,5,16,38],[17,1,17,4],[17,5,17,38],[13,1,13,38],[12,1,12,27]]}
[]
[null,"Instructions"]
[]
[null,"When opening this file, a yellow banner at the top may appear with a button that says, \"Enable Editing\", and/or \"Enable Macros\". It is essential that you click this box(es) so that the macros are enabled. Enabling macros is necessary for full workbook/application functionality.\n\nWARNING: Partial functionality of this application/workbook WILL BE LOST when using Apple Mac Computers. The Department highly recommends using PC Computers and Microsoft Office 2013 or newer to complete the application."]
[null,null,null,null,null,"Microsoft has recently added blocking of macros by default, if this happens when you open the Application, please follow the instructions in the Word document added as an icon to the right (double-click to open)."]
[]
[]
[null,"When completing this Application, it is highly advisable not to skip/jump to other sheets, start entering data from top to bottom and left to right when selecting a new sheet to work with."]
[null,"Application materials must be submitted electronically via HCD portal system. Requirements for uploading the Application Workbook and required supporting "]
[null,"documentation, including naming conventions, are described in the Application instructions available at  ",null,null,null,null,null,null,null,null,null,null,null,null,null,null,null,null,null,null,null,null,null,null,"2024 Homeownership Super NOFA"]
[null,"If applying to the CalHome Tribal Program, Applications will be accepted as set forth in the 2024 CalHome Tribal Notice of Funding Availability (NOFA).\nIf applying for the CalHome And/or Serna Home Ownership Program, Applications will be accepted as set forth in the 2024  Homeownership Super NOFA."]
[null,"Application must be on the Department’s forms and cannot be altered or modified by the Applicant. Excel forms must be in Excel format, not a PDF document. "]
[null,"If the Applicant discovers any errors within Application, use the Application Support tab and email the entire workbook to",null,null,null,null,null,null,null,null,null,null,null,null,null,null,null,null,null,null,null,null,null,null,null,null,null,null,"AppSupport@hcd.ca.gov"]
[null,"Additional instructions and guidance are given throughout the Application in \"red\" text and in cell comments. Cell Notes/Comments are very important to read as some of these will provide direction when completing your Application."]
[null,"\"Yellow\" cells ",null,null,null,"are for Applicant input. It is very important that you answer ALL yellow cells, failure to provide all information may disqualify your Application from consideration or may negatively impact your point score. Even if an item is not applicable - \"no\" or \"N/A\" must be filled from the drop down. "]
[null,"\"Orange\" cells",null,null,null,"are required attachments. Failure to provide the required attachments and documentation may disqualify your Application from consideration or may negatively impact your point score. Electronically attached files must use the naming convention in the Application."]
[null,"\"Blue\" cells",null,null,null,"are self-score points awarded in the \"Scoring\" worksheet. These are automated calculations based on the inputs provided by the Applicant. "]
[null,"\"Red\" cells",null,null,null,"indicate the Applicant has failed to meet a requirement of the program, threshold, scoring, upload, or certification."]
[null,"Disclosure of Application: Information provided in the application will become a public record available for review by the public, pursuant to the California Public Records Act (Chapter 1473, Statutes of 1968). As such, any materials provided will be disclosable to any person making a request under this Act. The Department cautions Applicants to use discretion in providing information not specifically requested, including but not limited to, bank account numbers, personal phone numbers and home addresses. By providing this information to the Department, the Applicant is waiving any claim of confidentiality and consents to the disclosure of submitted material upon request."]
[]
[null,"End of Document"]

{"sheet":"Project Overview","index":5,"n_rows":440,"n_cols":43,"rows_kept":440,"cut":false,"hidden":false,"merged":[[297,1,297,19],[297,20,297,33],[297,34,297,38],[298,1,298,19],[298,20,298,33],[298,34,298,38],[303,1,303,3],[303,4,303,12],[303,13,303,30],[303,31,303,36],[303,37,303,38],[299,1,299,38],[300,1,300,38],[301,1,301,3],[301,4,301,12],[301,13,301,30],[301,31,301,36],[301,37,301,38],[302,1,302,3],[302,4,302,12],[302,13,302,30],[302,31,302,36],[302,37,302,38],[293,1,293,15],[293,16,293,26],[293,27,293,32],[293,33,293,35],[293,36,293,38],[294,1,294,38],[295,1,295,38],[296,1,296,11],[296,12,296,36],[296,37,296,38],[168,1,168,19],[168,23,168,28],[176,1,176,4],[176,5,176,10],[292,1,292,15],[292,16,292,26],[292,27,292,32],[292,33,292,35],[292,36,292,38],[188,1,188,3],[188,4,188,12],[188,13,188,30],[188,31,188,36],[188,37,188,38],[185,1,185,4],[185,5,185,10],[183,1,183,19],[183,23,183,28],[186,1,186,27],[186,28,186,36],[183,29,183,38],[184,1,184,4],[184,5,184,19],[184,20,184,24],[174,1,174,19],[174,23,174,28],[152,1,152,4],[174,29,174,38],[175,1,175,4],[162,28,162,36],[162,37,162,38],[159,1,159,19],[159,23,159,28],[152,5,152,10],[168,29,168,38],[169,1,169,4],[169,5,169,19],[169,20,169,24],[160,1,160,4],[160,5,160,19],[160,20,160,24],[160,25,160,38],[161,1,161,4],[161,5,161,10],[155,13,155,30],[155,31,155,36],[164,4,164,12],[164,13,164,30],[178,27,178,38],[179,1,179,3],[179,4,179,12],[179,13,179,30],[179,31,179,36],[179,37,179,38],[177,1,177,27],[177,28,177,36],[177,37,177,38],[159,29,159,38],[157,1,157,38],[154,1,154,26],[154,27,154,38],[155,1,155,3],[155,4,155,12],[142,5,142,19],[142,20,142,24],[155,37,155,38],[144,1,144,27],[142,25,142,38],[143,1,143,4],[153,1,153,27],[153,28,153,36],[153,37,153,38],[144,28,144,36],[144,37,144,38],[150,23,150,28],[150,29,150,38],[151,1,151,4],[151,5,151,19],[151,20,151,24],[151,25,151,38],[52,1,52,36],[52,37,52,38],[53,1,53,5],[53,6,53,36],[54,1,54,36],[54,37,54,38],[55,1,55,10],[55,11,55,36],[56,1,56,36],[56,37,56,38],[150,1,150,19],[137,37,137,38],[135,1,135,27],[135,28,135,36],[135,37,135,38],[134,1,134,4],[136,1,136,26],[136,27,136,38],[137,1,137,3],[137,4,137,12],[137,13,137,30],[137,31,137,36],[145,1,145,26],[145,27,145,38],[146,1,146,3],[146,4,146,12],[146,13,146,30],[146,31,146,36],[146,37,146,38],[147,1,147,38],[148,1,148,38],[142,1,142,4],[128,1,128,3],[128,4,128,12],[128,13,128,30],[128,31,128,36],[128,37,128,38],[134,5,134,10],[132,1,132,19],[132,23,132,28],[132,29,132,38],[133,1,133,4],[133,5,133,19],[133,20,133,24],[133,25,133,38],[129,1,129,38],[130,1,130,38],[126,1,126,27],[126,28,126,36],[126,37,126,38],[127,1,127,26],[127,27,127,38],[106,5,106,19],[107,1,107,4],[107,5,107,10],[106,24,106,38],[114,29,114,38],[114,1,114,19],[114,23,114,28],[111,1,111,38],[112,1,112,38],[115,1,115,4],[115,5,115,19],[115,20,115,24],[115,25,115,38],[123,1,123,19],[123,23,123,28],[125,1,125,4],[110,31,110,36],[123,29,123,38],[117,1,117,27],[86,13,86,30],[83,37,83,38],[79,31,79,36],[79,37,79,38],[99,37,99,38],[98,1,98,4],[99,1,99,27],[99,28,99,36],[80,4,80,12],[88,1,88,3],[90,24,90,25],[90,27,90,36],[90,37,90,38],[91,1,91,10],[91,11,91,12],[92,1,92,10],[92,11,92,12],[93,1,93,10],[93,11,93,12],[91,27,91,36],[91,37,91,38],[88,4,88,12],[88,13,88,30],[88,31,88,36],[291,29,291,33],[291,34,291,38],[288,1,288,36],[288,37,288,38],[289,1,289,15],[4,1,4,36],[4,37,4,38],[103,1,103,38],[102,1,102,38],[120,1,120,38],[121,1,121,38],[138,1,138,38],[139,1,139,38],[156,1,156,38],[86,31,86,36],[86,37,86,38],[87,1,87,3],[87,4,87,12],[87,13,87,30],[87,31,87,36],[87,37,87,38],[80,37,80,38],[86,1,86,3],[86,4,86,12],[268,1,268,3],[268,4,268,12],[268,13,268,30],[268,31,268,36],[291,1,291,15],[291,16,291,18],[291,19,291,21],[283,2,283,36],[283,37,283,38],[289,16,289,18],[289,19,289,21],[289,22,289,28],[289,29,289,33],[289,34,289,38],[290,1,290,15],[290,16,290,18],[290,19,290,21],[290,22,290,28],[290,29,290,33],[290,34,290,36],[290,37,290,38],[285,1,285,36],[274,1,274,36],[272,2,272,36],[250,1,250,36],[251,2,251,36],[235,1,235,3],[235,4,235,12],[235,13,235,30],[235,31,235,36],[235,37,235,38],[244,1,244,3],[244,4,244,12],[244,13,244,30],[244,31,244,36],[238,2,238,36],[238,37,238,38],[246,1,246,36],[247,2,247,36],[247,37,247,38],[248,1,248,3],[248,4,248,12],[248,13,248,30],[251,37,251,38],[248,31,248,36],[248,37,248,38],[199,1,199,3],[199,4,199,12],[199,13,199,30],[199,31,199,36],[199,37,199,38],[220,3,220,36],[221,1,221,3],[223,1,223,36],[230,3,230,36],[225,1,225,36],[226,2,226,36],[228,1,228,36],[229,37,229,38],[229,2,229,36],[200,1,200,3],[211,3,211,36],[212,2,212,36],[213,3,213,36],[214,3,214,36],[215,2,215,36],[217,3,217,36],[200,31,200,36],[200,37,200,38],[198,13,198,30],[198,31,198,36],[184,25,184,38],[186,37,186,38],[187,1,187,26],[187,27,187,38],[170,1,170,4],[170,5,170,10],[162,1,162,27],[163,27,163,38],[164,1,164,3],[163,1,163,26],[189,1,189,38],[190,1,190,38],[197,37,197,38],[197,32,197,36],[197,1,197,31],[169,25,169,38],[165,1,165,38],[166,1,166,38],[181,1,181,38],[164,31,164,36],[164,37,164,38],[178,1,178,26],[88,37,88,38],[2,1,2,3],[2,4,2,8],[11,3,11,38],[26,3,26,38],[29,3,29,19],[32,3,32,19],[35,3,35,19],[37,3,37,19],[39,3,39,19],[13,1,13,2],[16,1,16,2],[19,1,19,2],[21,1,21,2],[23,1,23,2],[13,3,13,19],[16,3,16,19],[19,3,19,19],[21,3,21,19],[23,3,23,19],[29,1,29,2],[6,1,6,36],[6,37,6,38],[8,1,8,38],[26,1,26,2],[51,1,51,4],[51,5,51,11],[50,5,50,11],[50,27,50,30],[45,16,45,22],[45,23,45,26],[45,27,45,30],[141,1,141,19],[141,23,141,28],[141,29,141,38],[101,1,101,3],[101,4,101,12],[101,13,101,30],[101,31,101,36],[101,37,101,38],[98,5,98,10],[97,20,97,23],[97,24,97,38],[100,1,100,26],[97,1,97,4],[97,5,97,19],[96,1,96,19],[96,23,96,28],[96,29,96,38],[50,35,50,38],[50,31,50,34],[50,1,50,4],[50,12,50,15],[50,16,50,22],[50,23,50,26],[49,1,49,7],[48,1,48,38],[49,8,49,22],[85,1,85,3],[85,4,85,12],[85,13,85,30],[85,31,85,36],[64,1,64,3],[75,27,75,30],[61,14,61,15],[70,13,70,30],[77,12,77,15],[66,4,66,12],[79,1,79,3],[58,1,58,36],[58,37,58,38],[59,1,59,36],[45,12,45,15],[49,29,49,38],[47,1,47,22],[60,14,60,15],[51,31,51,34],[51,35,51,38],[57,1,57,38],[12,1,12,19],[28,1,28,19],[14,3,14,38],[30,3,30,38],[33,3,33,26],[33,27,33,38],[17,3,17,26],[17,27,17,38],[44,1,44,38],[32,1,32,2],[35,1,35,2],[37,1,37,2],[39,1,39,2],[41,1,41,2],[41,3,41,19],[51,23,51,26],[51,27,51,30],[432,28,432,30],[85,37,85,38],[82,37,82,38],[63,1,63,3],[81,4,81,12],[81,13,81,30],[66,31,66,36],[75,31,75,34],[66,13,66,30],[77,27,77,30],[80,13,80,30],[68,31,68,36],[79,4,79,12],[79,13,79,30],[77,31,77,34],[75,35,75,38],[77,1,77,4],[80,1,80,3],[69,37,69,38],[69,4,69,12],[69,13,69,30],[74,1,74,7],[74,8,74,22],[70,31,70,36],[439,1,439,38],[264,4,264,12],[266,1,266,38],[262,37,262,38],[264,31,264,36],[265,1,265,38],[264,1,264,3],[263,37,263,38],[264,37,264,38],[264,13,264,30],[343,1,343,36],[344,1,344,36],[272,37,272,38],[328,1,328,36],[329,2,329,36],[329,37,329,38],[335,1,335,36],[336,2,336,36],[336,37,336,38],[432,1,432,27],[431,1,431,27],[431,28,431,30],[431,33,431,38],[432,33,432,38],[1,1,1,38],[68,1,68,3],[67,31,67,36],[68,4,68,12],[68,13,68,30],[67,4,67,12],[67,37,67,38],[63,37,63,38],[65,1,65,3],[65,4,65,12],[65,31,65,36],[67,13,67,30],[68,37,68,38],[66,1,66,3],[64,37,64,38],[66,37,66,38],[51,12,51,15],[51,16,51,22],[65,13,65,30],[45,31,45,34],[45,35,45,38],[49,23,49,28],[45,1,45,4],[45,5,45,11],[430,1,430,27],[221,4,221,12],[430,33,430,38],[427,1,427,27],[427,28,427,30],[427,33,427,38],[428,1,428,27],[428,28,428,30],[425,1,425,27],[221,13,221,30],[221,31,221,36],[424,28,424,30],[424,33,424,38],[422,1,422,27],[422,28,422,30],[422,33,422,38],[423,1,423,27],[423,28,423,30],[428,33,428,38],[429,1,429,27],[429,28,429,30],[429,33,429,38],[430,28,430,30],[426,28,426,30],[426,33,426,38],[84,13,84,30],[84,31,84,36],[203,2,203,36],[203,37,203,38],[204,2,204,21],[204,22,204,25],[204,26,204,36],[205,2,205,36],[205,37,205,38],[206,3,206,36],[320,31,320,36],[425,28,425,30],[425,33,425,38],[426,1,426,27],[84,37,84,38],[84,1,84,3],[84,4,84,12],[413,1,413,36],[414,2,414,36],[362,37,362,38],[318,4,318,12],[198,4,198,12],[423,33,423,38],[59,37,59,38],[75,5,75,11],[75,12,75,15],[75,16,75,22],[64,13,64,30],[64,31,64,36],[65,37,65,38],[63,4,63,12],[63,13,63,30],[63,31,63,36],[61,1,61,13],[60,1,60,13],[81,37,81,38],[71,37,71,38],[70,1,70,3],[70,4,70,12],[70,37,70,38],[71,1,71,3],[71,4,71,12],[71,13,71,30],[71,31,71,36],[11,1,11,2],[64,4,64,12],[61,16,61,38],[83,31,83,36],[67,1,67,3],[73,1,73,36],[75,1,75,4],[77,16,77,22],[77,23,77,26],[69,31,69,36],[77,35,77,38],[80,31,80,36],[82,1,82,3],[82,4,82,12],[82,13,82,30],[82,31,82,36],[83,1,83,3],[83,4,83,12],[81,1,81,3],[81,31,81,36],[83,13,83,30],[75,23,75,26],[69,1,69,3],[77,5,77,11],[424,1,424,27],[332,37,332,38],[334,1,334,36],[350,1,350,36],[351,2,351,36],[351,37,351,38],[354,1,354,36],[355,1,355,36],[358,1,358,36],[356,37,356,38],[359,2,359,36],[359,37,359,38],[361,1,361,36],[362,2,362,36],[419,1,419,36],[420,2,420,36],[383,1,383,36],[404,2,404,36],[404,37,404,38],[393,1,393,36],[394,1,394,36],[395,2,395,36],[420,37,420,38],[417,2,417,36],[275,2,275,36],[275,37,275,38],[277,1,277,36],[278,2,278,36],[278,37,278,38],[270,1,270,36],[332,2,332,36],[319,1,319,3],[319,4,319,12],[319,13,319,30],[322,1,322,36],[323,2,323,36],[323,37,323,38],[325,1,325,36],[326,2,326,36],[320,37,320,38],[314,1,314,19],[314,20,314,33],[314,34,314,38],[305,1,305,36],[308,16,308,18],[305,37,305,38],[307,29,307,33],[291,22,291,28],[417,37,417,38],[345,2,345,36],[345,37,345,38],[347,1,347,36],[202,37,202,38],[234,4,234,12],[234,13,234,30],[234,31,234,36],[231,4,231,36],[232,4,232,36],[233,4,233,36],[237,1,237,36],[234,37,234,38],[233,37,233,38],[244,37,244,38],[239,3,239,36],[240,4,240,36],[241,4,241,36],[242,4,242,36],[243,4,243,36],[280,1,280,36],[307,34,307,36],[306,19,306,21],[216,2,216,36],[411,2,411,36],[411,37,411,38],[407,1,407,36],[408,2,408,36],[408,37,408,38],[391,1,391,3],[391,4,391,12],[391,13,391,30],[391,31,391,36],[391,37,391,38],[401,37,401,38],[395,37,395,38],[403,1,403,36],[406,1,406,36],[398,2,398,36],[398,37,398,38],[400,1,400,36],[410,1,410,36],[401,2,401,36],[397,1,397,36],[309,16,309,26],[309,27,309,32],[309,33,309,35],[379,1,379,36],[380,2,380,36],[380,37,380,38],[382,1,382,36],[307,37,307,38],[377,2,377,36],[308,19,308,21],[308,22,308,28],[308,29,308,33],[309,1,309,15],[377,37,377,38],[367,2,367,36],[367,37,367,38],[369,1,369,36],[374,2,374,36],[374,37,374,38],[376,1,376,36],[370,2,370,36],[370,37,370,38],[372,1,372,36],[373,1,373,36],[326,37,326,38],[315,1,315,19],[315,20,315,33],[315,34,315,38],[316,1,316,38],[317,1,317,38],[318,1,318,3],[318,31,318,36],[318,37,318,38],[320,4,320,12],[320,13,320,30],[318,13,318,30],[387,2,387,36],[387,37,387,38],[389,1,389,36],[390,2,390,36],[390,37,390,38],[356,2,356,36],[384,2,384,36],[384,37,384,38],[386,1,386,36],[363,31,363,36],[363,37,363,38],[365,1,365,36],[366,1,366,36],[100,27,100,38],[110,37,110,38],[105,1,105,19],[105,23,105,28],[105,29,105,38],[106,20,106,23],[110,1,110,3],[110,4,110,12],[110,13,110,30],[108,1,108,27],[108,28,108,36],[108,37,108,38],[109,1,109,26],[109,27,109,38],[106,1,106,4],[253,4,253,36],[254,4,254,36],[125,5,125,10],[118,1,118,26],[118,27,118,38],[119,1,119,3],[119,4,119,12],[119,13,119,30],[119,31,119,36],[119,37,119,38],[252,3,252,36],[226,37,226,38],[193,18,193,36],[196,37,196,38],[198,1,198,3],[218,3,218,36],[193,1,193,17],[200,4,200,12],[200,13,200,30],[234,1,234,3],[143,5,143,10],[171,1,171,38],[172,1,172,38],[180,1,180,38],[117,28,117,36],[117,37,117,38],[116,1,116,4],[116,5,116,10],[124,1,124,4],[124,5,124,19],[124,25,124,38],[124,20,124,24],[224,1,224,36],[175,5,175,19],[175,20,175,24],[175,25,175,38],[210,3,210,36],[198,37,198,38],[196,1,196,36],[192,1,192,36],[207,3,207,36],[208,3,208,36],[209,2,209,36],[202,1,202,36],[192,37,192,38],[193,37,193,38],[194,37,194,38],[194,1,194,13],[435,1,435,38],[434,1,434,8],[319,37,319,38],[320,1,320,3],[306,1,306,15],[306,16,306,18],[414,37,414,38],[416,1,416,36],[310,1,310,15],[310,16,310,26],[310,27,310,32],[310,33,310,35],[310,36,310,38],[311,1,311,38],[312,1,312,38],[313,1,313,11],[352,1,352,3],[308,34,308,38],[306,34,306,38],[363,1,363,3],[363,4,363,12],[363,13,363,30],[352,4,352,12],[352,13,352,30],[255,4,255,36],[352,31,352,36],[352,37,352,38],[307,1,307,15],[307,16,307,18],[307,19,307,21],[313,12,313,36],[313,37,313,38],[194,14,194,36],[195,1,195,22],[195,23,195,29],[256,1,256,3],[256,4,256,12],[256,13,256,30],[256,31,256,36],[261,4,261,36],[262,4,262,36],[263,4,263,36],[260,3,260,9],[286,1,286,38],[219,3,219,36],[221,37,221,38],[268,37,268,38],[271,1,271,36],[256,37,256,38],[259,1,259,36],[338,1,338,36],[339,2,339,36],[339,37,339,38],[331,1,331,36],[319,31,319,36],[309,36,309,38],[348,2,348,36],[340,1,340,3],[340,4,340,12],[340,13,340,30],[340,31,340,36],[340,37,340,38],[267,3,267,36],[281,1,281,36],[282,1,282,36],[258,1,258,36],[259,37,259,38],[306,22,306,28],[306,29,306,33],[307,22,307,28],[308,1,308,15],[348,37,348,38],[92,27,92,36],[92,37,92,38],[93,27,93,36],[93,37,93,38],[90,1,90,10],[90,11,90,12],[90,14,90,23],[94,27,94,36],[94,37,94,38],[94,1,94,10],[94,11,94,12],[91,14,91,23],[91,24,91,25],[92,14,92,23],[92,24,92,25],[93,14,93,23],[93,24,93,25],[94,14,94,23],[94,24,94,25]]}
[]
[null,"Project Overview"]
[null,"HCD APP#:"]
[]
[null,"“Optional Answer\" will not affect application review or ranking. Sponsor(s)/Applicant(s) or Joint Venture Entity meets CDLAC Definition of BIPOC Organization? per CDLAC 523(f)(1)(B), TCAC 10327(c)(2)(E)?"]
[]
[null,"Is the Applicant a \"Tribal Entity\" and exclusively applying for the 2024 CalHome Tribal Notice of Funding Availability (NOFA)?",null,null,null,null,null,null,null,null,null,null,null,null,null,null,null,null,null,null,null,null,null,null,null,null,null,null,null,null,null,null,null,null,null,null,null,null,null,null,"IsCalhomeTribal",{"$f":"vmIsCalhomeTribal=\"Yes\"","v":false}]
[]
[null,"Select the Program(s) for which to apply for funding: (Must select \"Yes\" or \"No\" for each Program and each Eligible Activity below)"]
[null,null,null,null,null,null,null,null,null,null,null,null,null,null,null,null,null,null,null,null,null,null,null,null,null,null,null,null,null,null,null,null,null,null,null,null,null,null,null,null,null,null,true]
[]
[null,null,null,"Joe Serna, Jr. Farmworker Housing Grant (Serna) Homeownership Program",null,null,null,null,null,null,null,null,null,null,null,null,null,null,null,null,null,null,null,null,null,null,null,null,null,null,null,null,null,null,null,null,null,null,null,null,"IsJSerna",{"$f":"vmIsJSerna=\"Yes\"","v":false},{"$f":"COUNTIF(AP14:AP24,AQ10)","v":0}]
[null,"Select Eligible Activities as follows: "]
[null,null,null,"Homeownership Development Project Loans",null,null,null,null,null,null,null,null,null,null,null,null,null,null,null,null,null,null,null,null,null,null,null,null,null,null,null,null,null,null,null,null,null,null,null,null,"IsJHDPL",{"$f":"vmIsJHDPL=\"Yes\"","v":false}]
[null,null,null,"If an Applicant is building new homeownership Assisted Units, the Applicant can either apply for a Homeownership Development Project Loan which the Applicant can later convert to a Mortgage Assistance Grant or apply only for a Mortgage Assistance Grant to assist Eligible Households to purchase the newly-constructed Assisted Units, but the Applicant cannot apply for both a Homeownership Development Project Loan and a Mortgage Assistance Grant for those same Assisted Units)."]
[]
[null,null,null,"Self-Help Technical Assistance Grants",null,null,null,null,null,null,null,null,null,null,null,null,null,null,null,null,null,null,null,null,null,null,null,null,null,null,null,null,null,null,null,null,null,null,null,null,"IsJSHTA",{"$f":"vmIsJSHTA=\"Yes\"","v":false}]
[null,null,null,"Is this Self-Help Technical Assistance Grant to support a Homeownership Development Project Loan or Mortgage Assistance program for which you are also applying for funding?"]
[]
[null,null,null,"Mortgage Assistance Grants",null,null,null,null,null,null,null,null,null,null,null,null,null,null,null,null,null,null,null,null,null,null,null,null,null,null,null,null,null,null,null,null,null,null,null,null,"IsJMA",{"$f":"vmIsJMA=\"Yes\"","v":false}]
[]
[null,null,null,"Owner-Occupied Rehabilitation Grants",null,null,null,null,null,null,null,null,null,null,null,null,null,null,null,null,null,null,null,null,null,null,null,null,null,null,null,null,null,null,null,null,null,null,null,null,"IsJOOR",{"$f":"vmIsJOOR=\"Yes\"","v":false}]
[]
[null,null,null,"Acquisition of Manufactured Housing Grants",null,null,null,null,null,null,null,null,null,null,null,null,null,null,null,null,null,null,null,null,null,null,null,null,null,null,null,null,null,null,null,null,null,null,null,null,"IsJAMH",{"$f":"vmIsJAMH=\"Yes\"","v":false}]
[]
[null,null,null,null,null,null,null,null,null,null,null,null,null,null,null,null,null,null,null,null,null,null,null,null,null,null,null,null,null,null,null,null,null,null,null,null,null,null,null,null,null,null,true]
[null,null,null,"CalHome Program",null,null,null,null,null,null,null,null,null,null,null,null,null,null,null,null,null,null,null,null,null,null,null,null,null,null,null,null,null,null,null,null,null,null,null,null,"IsCalhome",{"$f":"vmIsCalhome=\"Yes\"","v":false},{"$f":"COUNTIF(AP30:AP42,AQ26)","v":0}]
[]
[null,"Select Eligible Activities as follows: "]
[null,null,null,"Homeownership Development Project Loans",null,null,null,null,null,null,null,null,null,null,null,null,null,null,null,null,null,null,null,null,null,null,null,null,null,null,null,null,null,null,null,null,null,null,null,null,"IsHDPL",{"$f":"vmIsHDPL=\"Yes\"","v":false}]
[null,null,null,"If an Applicant is building new homeownership Assisted Units, the Applicant can either apply for a Homeownership Development Project Loan which the Applicant can later convert to a Mortgage Assistance Grant or apply only for a Mortgage Assistance Grant to assist Eligible Households to purchase the newly-constructed Assisted Units, but the Applicant cannot apply for both a Homeownership Development Project Loan and a Mortgage Assistance Grant for those same Assisted Units)."]
[]
[null,null,null,"Self Help Technical Assistance Grants",null,null,null,null,null,null,null,null,null,null,null,null,null,null,null,null,null,null,null,null,null,null,null,null,null,null,null,null,null,null,null,null,null,null,null,null,"IsSHTA",{"$f":"vmIsSHTA=\"Yes\"","v":false}]
[null,null,null,"Is this Self-Help Technical Assistance Grant to support a Homeownership Development Project Loan or Mortgage Assistance program for which you are also applying for funding?"]
[]
[null,null,null,"Mortgage Assistance Grants",null,null,null,null,null,null,null,null,null,null,null,null,null,null,null,null,null,null,null,null,null,null,null,null,null,null,null,null,null,null,null,null,null,null,null,null,"IsMA",{"$f":"vmIsMA=\"Yes\"","v":false}]
[]
[null,null,null,"Owner-Occupied Rehabilitation Grants",null,null,null,null,null,null,null,null,null,null,null,null,null,null,null,null,null,null,null,null,null,null,null,null,null,null,null,null,null,null,null,null,null,null,null,null,"IsOOR",{"$f":"vmIsOOR=\"Yes\"","v":false}]
[]
[null,null,null,"Shared Housing Grants",null,null,null,null,null,null,null,null,null,null,null,null,null,null,null,null,null,null,null,null,null,null,null,null,null,null,null,null,null,null,null,null,null,null,null,null,"IsSH",{"$f":"vmIsSH=\"Yes\"","v":false}]
[]
[null,null,null,"Accessory Dwelling Units/Junior Accessory Dwelling Units Grants",null,null,null,null,null,null,null,null,null,null,null,null,null,null,null,null,null,null,null,null,null,null,null,null,null,null,null,null,null,null,null,null,null,null,null,null,"IsJADU",{"$f":"vmIsJADU=\"Yes\"","v":false}]
[]
[]
[null,"Application preparer Information"]
[null,"Preparer name:",null,null,null,null,null,null,null,null,null,null,"Preparer e-mail:",null,null,null,null,null,null,null,null,null,null,"Preparer title:",null,null,null,null,null,null,null,"Preparer phone:"]
[]
[null,"§200 Eligible Applicant"]
[null,"Sponsor- This term is only applicable for Homeownership Development Project Loans. A Sponsor is an entity who constructs, develops, rehabilitates, purchases, or owns a housing development that is or will be subject to legally enforceable restrictive covenants that require the housing development to provide, at least in part, Affordable housing."]
[null,"Eligible Applicant Name:",null,null,null,null,null,null,null,null,null,null,null,null,null,null,null,null,null,null,null,null,null,"Eligible Applicant Type:"]
[null,"Contact name:",null,null,null,null,null,null,null,null,null,null,"Contact e-mail:",null,null,null,null,null,null,null,null,null,null,"Contact title:",null,null,null,null,null,null,null,"Contact phone:"]
[null,"Alternate Contact name:",null,null,null,null,null,null,null,null,null,null,"Alternate Contact e-mail:",null,null,null,null,null,null,null,null,null,null,"Alternate Contact title:",null,null,null,null,null,null,null,"Alternate Contact phone:"]
[null,"Are there affiliate or subsidiary entities that provide operational or financial support to the Applicant?"]
[null,"If yes, provide the affiliate/subsidiary entity(ies) name(s):"]
[null,"Is the Applicant an affiliate or subsidiary of another entity such as a parent company?"]
[null,"If yes, provide the parent company name:"]
[null,"Will the Applicant rely on related party entity(ies) to develop, construct, or operate the proposed Project?"]
[null,"Tribal Entity, please read §100(e) and note that AB 1010 does not automatically operate to obviate, or otherwise modify, any provision(s) of the Guidelines. To the extent that a Tribal Entity applicant believes that AB 1010 is applicable to such Tribal Entity, their Application, the Project to which their Application relates, or any number of them, it is recommended that such Tribal Entity applicant submit an AB 1010 waiver request to the Department before applications are due under the applicable NOFA to ensure that the Department has adequate time to review such waiver request and render a decision granting, or rejecting, the request."]
[null,"§200.1 Applicant acknowledges and certifies to the Serna Limited Partnership Eligibility Requirements?"]
[null,"§200.2 Applicant acknowledges and certifies to the Serna-Nonprofit Corporation Eligibility Requirements?"]
[null,"Is the Applicant being controlled by a parent company?"]
[null,"Is the controlling company a nonprofit corporation?",null,null,null,null,null,null,null,null,null,null,null,null,null,null,{"$f":"IF($O$62=\"No\",\"Applicant must be independent from any direction of, or control by, a for-profit entity\",\"\")","v":""}]
[]
[null,"File Name:",null,null,{"$f":"'Document Checklist-Full List'!$B$9","v":"02. Certification & Legal Disclosure"},null,null,null,null,null,null,null,null,{"$f":"'Document Checklist-Full List'!$K$9","v":"Reference: Applicant Certification Worksheet."},null,null,null,null,null,null,null,null,null,null,null,null,null,null,null,null,null,"Uploaded to HCD?"]
[null,"File Name:",null,null,{"$f":"'Document Checklist-Full List'!$B$10","v":"02. OrgDoc1, OrgDoc2, etc."},null,null,null,null,null,null,null,null,{"$f":"'Document Checklist-Full List'!$K$10","v":"Reference: Entity Org Docs Worksheet."},null,null,null,null,null,null,null,null,null,null,null,null,null,null,null,null,null,"Uploaded to HCD?"]
[null,"File Name:",null,null,{"$f":"'Document Checklist-Full List'!$B$11","v":"02. Organizational Chart"},null,null,null,null,null,null,null,null,{"$f":"'Document Checklist-Full List'!$K$11","v":"Applicant Organization Chart."},null,null,null,null,null,null,null,null,null,null,null,null,null,null,null,null,null,"Uploaded to HCD?"]
[null,"File Name:",null,null,{"$f":"'Document Checklist-Full List'!$B$12","v":"02. Signature Block"},null,null,null,null,null,null,null,null,{"$f":"'Document Checklist-Full List'!$K$12","v":"Signature Block - upload in Microsoft Word document."},null,null,null,null,null,null,null,null,null,null,null,null,null,null,null,null,null,"Uploaded to HCD?"]
[null,"File Name:",null,null,{"$f":"'Document Checklist-Full List'!$B$13","v":"02. Cert of Good Standing "},null,null,null,null,null,null,null,null,{"$f":"'Document Checklist-Full List'!$K$13","v":"Certificate of Good Standing dated within 30 days of the application due date."},null,null,null,null,null,null,null,null,null,null,null,null,null,null,null,null,null,"Uploaded to HCD?"]
[null,"File Name:",null,null,{"$f":"'Document Checklist-Full List'!$B$14","v":"02. Tax-Exempt Status"},null,null,null,null,null,null,null,null,{"$f":"'Document Checklist-Full List'!$K$14","v":"Evidence of tax-exempt status from IRS and FTB for Corporations (Non-Profits Only)."},null,null,null,null,null,null,null,null,null,null,null,null,null,null,null,null,null,"Uploaded to HCD?"]
[null,"File Name:",null,null,{"$f":"'Document Checklist-Full List'!$B$15","v":"02. Payee Data Record"},null,null,null,null,null,null,null,null,{"$f":"'Document Checklist-Full List'!$K$15","v":"Completed Payee Data Record."},null,null,null,null,null,null,null,null,null,null,null,null,null,null,null,null,null,"Uploaded to HCD?"]
[null,"File Name:",null,null,{"$f":"'Document Checklist-Full List'!$B$16","v":"02. TIN Form"},null,null,null,null,null,null,null,null,{"$f":"'Document Checklist-Full List'!$K$16","v":"Completed Government TIN form"},null,null,null,null,null,null,null,null,null,null,null,null,null,null,null,null,null,"Uploaded to HCD?"]
[null,"File Name:",null,null,{"$f":"'Document Checklist-Full List'!$B$17","v":"02. Resolution"},null,null,null,null,null,null,null,null,{"$f":"'Document Checklist-Full List'!$K$17","v":"Executed resolution on HCD provided template."},null,null,null,null,null,null,null,null,null,null,null,null,null,null,null,null,null,"Uploaded to HCD?"]
[]
[null,"Controlling Nonprofit Corporation"]
[null,"Company Name:"]
[null,"Contact name:",null,null,null,null,null,null,null,null,null,null,"Contact e-mail:",null,null,null,null,null,null,null,null,null,null,"Contact title:",null,null,null,null,null,null,null,"Contact phone:"]
[null,"Alternate Contact information:"]
[null,"Contact name:",null,null,null,null,null,null,null,null,null,null,"Contact e-mail:",null,null,null,null,null,null,null,null,null,null,"Contact title:",null,null,null,null,null,null,null,"Contact phone:"]
[]
[null,"File Name:",null,null,{"$f":"'Document Checklist-Full List'!$B$19","v":"03. Certification & Legal Disclosure"},null,null,null,null,null,null,null,null,{"$f":"'Document Checklist-Full List'!$K$19","v":"Reference: Applicant Certification Worksheet."},null,null,null,null,null,null,null,null,null,null,null,null,null,null,null,null,null,"Uploaded to HCD?"]
[null,"File Name:",null,null,{"$f":"'Document Checklist-Full List'!$B$20","v":"03. OrgDoc1, OrgDoc2, etc."},null,null,null,null,null,null,null,null,{"$f":"'Document Checklist-Full List'!$K$20","v":"Reference: Entity Org Docs Worksheet."},null,null,null,null,null,null,null,null,null,null,null,null,null,null,null,null,null,"Uploaded to HCD?"]
[null,"File Name:",null,null,{"$f":"'Document Checklist-Full List'!$B$21","v":"03. Project Specific Organizational Chart"},null,null,null,null,null,null,null,null,{"$f":"'Document Checklist-Full List'!$K$21","v":"Applicant Organization Chart."},null,null,null,null,null,null,null,null,null,null,null,null,null,null,null,null,null,"Uploaded to HCD?"]
[null,"File Name:",null,null,{"$f":"'Document Checklist-Full List'!$B$22","v":"03. Signature Block"},null,null,null,null,null,null,null,null,{"$f":"'Document Checklist-Full List'!$K$22","v":"Signature Block - upload in Microsoft Word document."},null,null,null,null,null,null,null,null,null,null,null,null,null,null,null,null,null,"Uploaded to HCD?"]
[null,"File Name:",null,null,{"$f":"'Document Checklist-Full List'!$B$23","v":"03. Cert of Good Standing "},null,null,null,null,null,null,null,null,{"$f":"'Document Checklist-Full List'!$K$23","v":"Certificate of Good Standing dated within 30 days of the application due date."},null,null,null,null,null,null,null,null,null,null,null,null,null,null,null,null,null,"Uploaded to HCD?"]
[null,"File Name:",null,null,{"$f":"'Document Checklist-Full List'!$B$24","v":"03. Tax-Exempt Status"},null,null,null,null,null,null,null,null,{"$f":"'Document Checklist-Full List'!$K$24","v":"Evidence of tax-exempt status from IRS and FTB for Corporations (Non-Profits Only)."},null,null,null,null,null,null,null,null,null,null,null,null,null,null,null,null,null,"Uploaded to HCD?"]
[null,"File Name:",null,null,{"$f":"'Document Checklist-Full List'!$B$25","v":"03. Payee Data Record"},null,null,null,null,null,null,null,null,{"$f":"'Document Checklist-Full List'!$K$25","v":"Completed Payee Data Record."},null,null,null,null,null,null,null,null,null,null,null,null,null,null,null,null,null,"Uploaded to HCD?"]
[null,"File Name:",null,null,{"$f":"'Document Checklist-Full List'!$B$26","v":"03. TIN Form"},null,null,null,null,null,null,null,null,{"$f":"'Document Checklist-Full List'!$K$26","v":"Completed Government TIN form"},null,null,null,null,null,null,null,null,null,null,null,null,null,null,null,null,null,"Uploaded to HCD?"]
[null,"File Name:",null,null,{"$f":"'Document Checklist-Full List'!$B$27","v":"03. Resolution"},null,null,null,null,null,null,null,null,{"$f":"'Document Checklist-Full List'!$K$27","v":"Executed resolution on HCD provided template."},null,null,null,null,null,null,null,null,null,null,null,null,null,null,null,null,null,"Uploaded to HCD?"]
[null,"File Name:",null,null,{"$f":"'Document Checklist-Full List'!$B$28","v":"03. Limited Partnership Agreement"},null,null,null,null,null,null,null,null,{"$f":"'Document Checklist-Full List'!$K$28","v":"Limited Partnership agreement, any Limited Liability Company operating agreement, the articles and bylaws of any Nonprofit Corporation, and any pertinent side agreements, between limited and general partners relating to the management and operation of the Limited Partnership (collectively, “organizational documents”)."},null,null,null,null,null,null,null,null,null,null,null,null,null,null,null,null,null,"Uploaded to HCD?"]
[]
[null,"Congress person Name(s)",null,null,null,null,null,null,null,null,null,"District #",null,null,"State Senator Name(s)",null,null,null,null,null,null,null,null,null,"District #",null,null,"State Assembly Member Name(s)",null,null,null,null,null,null,null,null,null,"District #"]
[]
[]
[]
[]
[]
[null,"Homeownership Development Project Loans - CalHome",null,null,null,null,null,null,null,null,null,null,null,null,null,null,null,null,null,null,null,null,null,"Geographic Location:",null,null,null,null,null,{"$f":"IF($F$99>0,VLOOKUP($F$99,Dropdowns!$B$10:$C$67,2,FALSE),\"\")","v":""}]
[null,"Project Name",null,null,null,null,null,null,null,null,null,null,null,null,null,null,null,null,null,null,"Project Address"]
[null,"Project County"]
[null,"Is Project located in a Rural Area as defined by H&S Code §50199.21? Applicant must use the TCAC Method for determining rural status.",null,null,null,null,null,null,null,null,null,null,null,null,null,null,null,null,null,null,null,null,null,null,null,null,null,null,"Documentation of rural status"]
[null,"Which methodology is being used to demonstrate that the Project/Program area is rural?"]
[null,"File Name:",null,null,{"$f":"'Document Checklist-Full List'!$B$30","v":"04. Rural Status Determination"},null,null,null,null,null,null,null,null,{"$f":"'Document Checklist-Full List'!$K$30","v":"TCAC Method for determining rural status."},null,null,null,null,null,null,null,null,null,null,null,null,null,null,null,null,null,"Uploaded to HCD?"]
[null,"Project description - CalHome (Homeownership Development Project Loans)"]
[]
[]
[null,"Homeownership Development Project Loans - FWHG",null,null,null,null,null,null,null,null,null,null,null,null,null,null,null,null,null,null,null,null,null,"Geographic Location:",null,null,null,null,null,{"$f":"IF(County>0,VLOOKUP(County,Dropdowns!$B$10:$C$67,2,FALSE),\"\")","v":""}]
[null,"Project Name",null,null,null,null,null,null,null,null,null,null,null,null,null,null,null,null,null,null,"Project Address"]
[null,"Project County"]
[null,"Is Project located in a Rural Area as defined by H&S Code §50199.21? Applicant must use the TCAC Method for determining rural status.",null,null,null,null,null,null,null,null,null,null,null,null,null,null,null,null,null,null,null,null,null,null,null,null,null,null,"Documentation of rural status"]
[null,"Which methodology is being used to demonstrate that the Project/Program area is rural?"]
[null,"File Name:",null,null,{"$f":"'Document Checklist-Full List'!$B$30","v":"04. Rural Status Determination"},null,null,null,null,null,null,null,null,{"$f":"'Document Checklist-Full List'!$K$30","v":"TCAC Method for determining rural status."},null,null,null,null,null,null,null,null,null,null,null,null,null,null,null,null,null,"Uploaded to HCD?"]
[null,"Project description - Homeownership Development Project Loans (FWHG)"]
[]
[]
[null,"Self-Help Technical Assistance Grants - CalHome",null,null,null,null,null,null,null,null,null,null,null,null,null,null,null,null,null,null,null,null,null,"Geographic Location:",null,null,null,null,null,{"$f":"IF($F$117>0,VLOOKUP($F$117,Dropdowns!$B$10:$C$67,2,FALSE),\"\")","v":""}]
[null,"Program Name",null,null,null,null,null,null,null,null,null,null,null,null,null,null,null,null,null,null,"Program Address"]
[null,"Program County"]
[null,"Will all the units be located in a Rural Area as defined by H&S Code §50199.21? Applicant must use the TCAC Method for determining rural status.",null,null,null,null,null,null,null,null,null,null,null,null,null,null,null,null,null,null,null,null,null,null,null,null,null,null,"Documentation of rural status"]
[null,"Which methodology is being used to demonstrate that the Project/Program area is rural?"]
[null,"File Name:",null,null,{"$f":"'Document Checklist-Full List'!$B$30","v":"04. Rural Status Determination"},null,null,null,null,null,null,null,null,{"$f":"'Document Checklist-Full List'!$K$30","v":"TCAC Method for determining rural status."},null,null,null,null,null,null,null,null,null,null,null,null,null,null,null,null,null,"Uploaded to HCD?"]
[null,"Program description -  Self-Help Technical Assistance Grants (CalHome)"]
[]
[]
[null,"Self-Help Technical Assistance Grants - FWHG",null,null,null,null,null,null,null,null,null,null,null,null,null,null,null,null,null,null,null,null,null,"Geographic Location:",null,null,null,null,null,{"$f":"IF($F$126>0,VLOOKUP($F$126,Dropdowns!$B$10:$C$67,2,FALSE),\"\")","v":""}]
[null,"Program Name",null,null,null,null,null,null,null,null,null,null,null,null,null,null,null,null,null,null,"Program Address"]
[null,"Program County"]
[null,"Will all the units be located in a Rural Area as defined by H&S Code §50199.21? Applicant must use the TCAC Method for determining rural status.",null,null,null,null,null,null,null,null,null,null,null,null,null,null,null,null,null,null,null,null,null,null,null,null,null,null,"Documentation of rural status"]
[null,"Which methodology is being used to demonstrate that the Project/Program area is rural?"]
[null,"File Name:",null,null,{"$f":"'Document Checklist-Full List'!$B$30","v":"04. Rural Status Determination"},null,null,null,null,null,null,null,null,{"$f":"'Document Checklist-Full List'!$K$30","v":"TCAC Method for determining rural status."},null,null,null,null,null,null,null,null,null,null,null,null,null,null,null,null,null,"Uploaded to HCD?"]
[null,"Program description - Self-Help Technical Assistance Grants (FWHG)"]
[]
[]
[null,"Mortgage Assistance Grants - CalHome",null,null,null,null,null,null,null,null,null,null,null,null,null,null,null,null,null,null,null,null,null,"Geographic Location:",null,null,null,null,null,{"$f":"IF($F$135>0,VLOOKUP($F$135,Dropdowns!$B$10:$C$67,2,FALSE),\"\")","v":""}]
[null,"Program Name",null,null,null,null,null,null,null,null,null,null,null,null,null,null,null,null,null,null,"Program Address"]
[null,"Program County"]
[null,"Will all the units be located in a Rural Area as defined by H&S Code §50199.21? Applicant must use the TCAC Method for determining rural status.",null,null,null,null,null,null,null,null,null,null,null,null,null,null,null,null,null,null,null,null,null,null,null,null,null,null,"Documentation of rural status"]
[null,"Which methodology is being used to demonstrate that the Project/Program area is rural?"]
[null,"File Name:",null,null,{"$f":"'Document Checklist-Full List'!$B$30","v":"04. Rural Status Determination"},null,null,null,null,null,null,null,null,{"$f":"'Document Checklist-Full List'!$K$30","v":"TCAC Method for determining rural status."},null,null,null,null,null,null,null,null,null,null,null,null,null,null,null,null,null,"Uploaded to HCD?"]
[null,"Program description - Mortgage Assistance Grants (CalHome)"]
[]
[]
[null,"Mortgage Assistance Grants - FWHG",null,null,null,null,null,null,null,null,null,null,null,null,null,null,null,null,null,null,null,null,null,"Geographic Location:",null,null,null,null,null,{"$f":"IF($F$144>0,VLOOKUP($F$144,Dropdowns!$B$10:$C$67,2,FALSE),\"\")","v":""}]
[null,"Program Name",null,null,null,null,null,null,null,null,null,null,null,null,null,null,null,null,null,null,"Program Address"]
[null,"Program County"]
[null,"Will all the units be located in a Rural Area as defined by H&S Code §50199.21? Applicant must use the TCAC Method for determining rural status.",null,null,null,null,null,null,null,null,null,null,null,null,null,null,null,null,null,null,null,null,null,null,null,null,null,null,"Documentation of rural status"]
[null,"Which methodology is being used to demonstrate that the Project/Program area is rural?"]
[null,"File Name:",null,null,{"$f":"'Document Checklist-Full List'!$B$30","v":"04. Rural Status Determination"},null,null,null,null,null,null,null,null,{"$f":"'Document Checklist-Full List'!$K$30","v":"TCAC Method for determining rural status."},null,null,null,null,null,null,null,null,null,null,null,null,null,null,null,null,null,"Uploaded to HCD?"]
[null,"Program description - Mortgage Assistance Grants (FWHG)"]
[]
[]
[null,"Owner-Occupied Rehabilitation Grants - CalHome",null,null,null,null,null,null,null,null,null,null,null,null,null,null,null,null,null,null,null,null,null,"Geographic Location:",null,null,null,null,null,{"$f":"IF($F$153>0,VLOOKUP($F$153,Dropdowns!$B$10:$C$67,2,FALSE),\"\")","v":""}]
[null,"Program Name",null,null,null,null,null,null,null,null,null,null,null,null,null,null,null,null,null,null,"Program Address"]
[null,"Program County"]
[null,"Will all the units be located in a Rural Area as defined by H&S Code §50199.21? Applicant must use the TCAC Method for determining rural status.",null,null,null,null,null,null,null,null,null,null,null,null,null,null,null,null,null,null,null,null,null,null,null,null,null,null,"Documentation of rural status"]
[null,"Which methodology is being used to demonstrate that the Project/Program area is rural?"]
[null,"File Name:",null,null,{"$f":"'Document Checklist-Full List'!$B$30","v":"04. Rural Status Determination"},null,null,null,null,null,null,null,null,{"$f":"'Document Checklist-Full List'!$K$30","v":"TCAC Method for determining rural status."},null,null,null,null,null,null,null,null,null,null,null,null,null,null,null,null,null,"Uploaded to HCD?"]
[null,"Program description - Owner-Occupied Rehabilitation Grants (CalHome)"]
[]
[]
[null,"Owner-Occupied Rehabilitation Grants - FWHG",null,null,null,null,null,null,null,null,null,null,null,null,null,null,null,null,null,null,null,null,null,"Geographic Location:",null,null,null,null,null,{"$f":"IF($F$162>0,VLOOKUP($F$162,Dropdowns!$B$10:$C$67,2,FALSE),\"\")","v":""}]
[null,"Program Name",null,null,null,null,null,null,null,null,null,null,null,null,null,null,null,null,null,null,"Program Address"]
[null,"Program County"]
[null,"Will all the units be located in a Rural Area as defined by H&S Code §50199.21? Applicant must use the TCAC Method for determining rural status.",null,null,null,null,null,null,null,null,null,null,null,null,null,null,null,null,null,null,null,null,null,null,null,null,null,null,"Documentation of rural status"]
[null,"Which methodology is being used to demonstrate that the Project/Program area is rural?"]
[null,"File Name:",null,null,{"$f":"'Document Checklist-Full List'!$B$30","v":"04. Rural Status Determination"},null,null,null,null,null,null,null,null,{"$f":"'Document Checklist-Full List'!$K$30","v":"TCAC Method for determining rural status."},null,null,null,null,null,null,null,null,null,null,null,null,null,null,null,null,null,"Uploaded to HCD?"]
[null,"Program description - Owner-Occupied Rehabilitation Grants (FWHG)"]
[]
[]
[null,"Shared Housing Grants - CalHome",null,null,null,null,null,null,null,null,null,null,null,null,null,null,null,null,null,null,null,null,null,"Geographic Location:",null,null,null,null,null,{"$f":"IF($F$171>0,VLOOKUP($F$171,Dropdowns!$B$10:$C$67,2,FALSE),\"\")","v":""}]
[null,"Program Name",null,null,null,null,null,null,null,null,null,null,null,null,null,null,null,null,null,null,"Program Address"]
[null,"Program County"]
[null,"Program description - Shared Housing Grants (CalHome)"]
[]
[]
[null,"Accessory Dwelling Units/Junior Accessory Dwelling Units Grants - CalHome",null,null,null,null,null,null,null,null,null,null,null,null,null,null,null,null,null,null,null,null,null,"Geographic Location:",null,null,null,null,null,{"$f":"IF($F$177>0,VLOOKUP($F$177,Dropdowns!$B$10:$C$67,2,FALSE),\"\")","v":""}]
[null,"Program Name",null,null,null,null,null,null,null,null,null,null,null,null,null,null,null,null,null,null,"Program Address"]
[null,"Program County"]
[null,"Will all the units be located in a Rural Area as defined by H&S Code §50199.21? Applicant must use the TCAC Method for determining rural status.",null,null,null,null,null,null,null,null,null,null,null,null,null,null,null,null,null,null,null,null,null,null,null,null,null,null,"Documentation of rural status"]
[null,"Which methodology is being used to demonstrate that the Project/Program area is rural?"]
[null,"File Name:",null,null,{"$f":"'Document Checklist-Full List'!$B$30","v":"04. Rural Status Determination"},null,null,null,null,null,null,null,null,{"$f":"'Document Checklist-Full List'!$K$30","v":"TCAC Method for determining rural status."},null,null,null,null,null,null,null,null,null,null,null,null,null,null,null,null,null,"Uploaded to HCD?"]
[null,"Program description - Accessory Dwelling Units/Junior Accessory Dwelling Units Grants (CalHome)"]
[]
[]
[null,"Acquisition of Manufactured Housing Grants - FWHG",null,null,null,null,null,null,null,null,null,null,null,null,null,null,null,null,null,null,null,null,null,"Geographic Location:",null,null,null,null,null,{"$f":"IF($F$186>0,VLOOKUP($F$186,Dropdowns!$B$10:$C$67,2,FALSE),\"\")","v":""}]
[null,"Program Name",null,null,null,null,null,null,null,null,null,null,null,null,null,null,null,null,null,null,"Program Address"]
[null,"Program County"]
[null,"Will all the units be located in a Rural Area as defined by H&S Code §50199.21? Applicant must use the TCAC Method for determining rural status.",null,null,null,null,null,null,null,null,null,null,null,null,null,null,null,null,null,null,null,null,null,null,null,null,null,null,"Documentation of rural status"]
[null,"Which methodology is being used to demonstrate that the Project/Program area is rural?"]
[null,"File Name:",null,null,{"$f":"'Document Checklist-Full List'!$B$30","v":"04. Rural Status Determination"},null,null,null,null,null,null,null,null,{"$f":"'Document Checklist-Full List'!$K$30","v":"TCAC Method for determining rural status."},null,null,null,null,null,null,null,null,null,null,null,null,null,null,null,null,null,"Uploaded to HCD?"]
[null,"Program description - Acquisition of Manufactured Housing Grants (FWHG)"]
[]
[]
[null,"Does the Applicant wish to apply to the Community-Based Developer funding target? NOFA (II)(d)(1)(b)"]
[null,"Is Project/Program being proposed by a Community-Based Developer?",null,null,null,null,null,null,null,null,null,null,null,null,null,null,null,null,"See Appendix A- Definitions"]
[null,"Is the Community-Based Developer a Tribal Entity?",null,null,null,null,null,null,null,null,null,null,null,null,"See Appendix A- Definitions"]
[null,"Is Project located in Indian Country, or located on fee land within the state of California?"]
[null,"APPENDIX B- Tribal Eligibility (b)(1-4), The Applicant meets the following conditions of Award funding to the extent applicable, and, subject to any modifications or waivers as provided for in H.S.C. §50406, subdivision (p) (Assembly Bill 1010 (Chapter 660, Statutes of 2019) that shall be set forth in a Standard Agreement. It is noted that these same conditions do not need to be satisfied initially to engage in the competitive Award process."]
[null,"APPENDIX B- Tribal Eligibility (B), Applicant acknowledges per the Director’s Memo and LWSI Omnibus Amendment, the Department has removed the Limited Waiver of Sovereign Immunity (LWSI) requirement from this housing program, making it easier for tribes to access critical housing resources. In addition, AB 1878 prohibits the Department from requiring a waiver for this program to the extent that not requiring such a waiver is not in conflict with applicable law.",null,null,null,null,null,null,null,null,null,null,null,null,null,null,null,null,null,null,null,null,null,null,null,null,null,null,null,null,null,null,"Director’s Memo and LWSI Omnibus Amendment"]
[null,"File Name:",null,null,{"$f":"'Document Checklist-Full List'!$B$32","v":"06. Tribal Entity Waiver"},null,null,null,null,null,null,null,null,{"$f":"'Document Checklist-Full List'!$K$32","v":"Modifications or waivers as provided for in HSC Section 50406, subdivision (p) (Assembly Bill 1010 (Chapter 660, Statutes of 2019)."},null,null,null,null,null,null,null,null,null,null,null,null,null,null,null,null,null,"Uploaded to HCD?"]
[null,"File Name:",null,null,{"$f":"'Document Checklist-Full List'!$B$33","v":"07. Indian Country Verification"},null,null,null,null,null,null,null,null,{"$f":"'Document Checklist-Full List'!$K$33","v":"Documentation verifying land is located in Indian Country as defined by 18 USC 1151."},null,null,null,null,null,null,null,null,null,null,null,null,null,null,null,null,null,"Uploaded to HCD?"]
[null,"File Name:",null,null,{"$f":"'Document Checklist-Full List'!$B$34","v":"08. Fee Land Verification"},null,null,null,null,null,null,null,null,{"$f":"'Document Checklist-Full List'!$K$34","v":"Documentation verifying land is located on Fee land."},null,null,null,null,null,null,null,null,null,null,null,null,null,null,null,null,null,"Uploaded to HCD?"]
[]
[null,"The Community-Based Developer certifies to meet the experience requirements set forth in Appendix A."]
[null,"(a)","Sponsor/Applicant certifies that they have been operating in the community to be served by the Project for a period of at least twenty-four (24) consecutive months immediately preceding application submittal."]
[null,null,"Provide the date the entity started operating in the community to be serve by the project."]
[null,"(b)","Applicant certifies to provide a map in Attachment \"CB Developer Experience\" documenting that the community does not exceed ten (10) square miles for non-Rural Areas or twenty (20) square miles for Rural Areas.\nIn addition, the defined community must comply with the following, documented in Attachment \"CB Developer Experience\":"]
[null,null,"(1)","be primarily or exclusively located in a Moderate and/or Low Resource area or in a High Segregation & Poverty area, as designated in the most recently updated TCAC/HCD Opportunity Area Map or in such comparable federal map(s) as approved by the Department;"]
[null,null,"(2)","include the Project to be funded by the award; and "]
[null,null,"(3)","subject to subsection (c) immediately following, include the entity’s corporate office within its boundaries."]
[null,"(c)","The Community-Based Developer satisfies one of the following geographic requirements, documented in Attachment \"CB Developer Experience\":"]
[null,null,"(1)","Where the proposed Project is located in a non-Rural Area, either: (A) the entity maintains a corporate office within five (5) miles of the proposed Project, or (B) the entity has developed, owned, or operated at least three (3) deed-restricted affordable housing projects located within ten (10) miles of the proposed Project; or "]
[null,null,"(2)","Where the proposed Project is located in a Rural Area, either: (A) the entity maintains a corporate office within ten (10) miles of the proposed Project, or (B) the entity has developed, owned, or operated at least three (3) deed-restricted affordable housing projects located within twenty (20) miles of the proposed Project."]
[null,"(d)","The Community-Based Developer satisfies both of the following experience requirements, documented in Attachment \"CB Developer Experience\": "]
[null,null,"(1)","The entity has developed, owned, or operated at least one (1) Rental Housing Development that is equivalent to the proposed Project in size, scale, level of amenities, and occupancy. The Department may determine experience by evaluating the experience of the entity itself or the experience of senior staff within the organization. If the experience requirement is satisfied by one or more of the Community-Based Developer’s senior staff members, then the Standard Agreement and the loan documents shall include a Sponsor obligation to provide the Department with immediate written notice in the event of such member’s or members’ departure from or termination by the entity. "]
[null,null,"(2)","The entity has at least five (5) years’ experience in the delivery of Culturally Competent Services and/or Community Benefit Programs to Very Low Income and/or Lower Income households in the communities served by the entity. This experience must include direct, in-person delivery of at least two (2) Culturally Competent Services and/or Community Benefit Programs to the general public within ten (10) miles of the proposed Project. Such services or programs must have been provided on an ongoing basis and during core business hours, and they cannot have been provided at an existing affordable housing project. Provide detailed information and documentation of each service and/or program in Attachment 9, including location and number of years."]
[null,"(e)","The Community-Based Developer can serve no more than three (3) distinct geographic communities, as demonstrated by the location or delivery site of corporate offices, affordable housing projects, Culturally Competent Services, and/or Community Benefit Programs. All geographic communities served must be documented, described, and visually identified in Attachment \"CB Developer Experience\"."]
[null,"(f)","The Community-Based Developer must have community knowledge, commitment to long-term community investment, and population-specific cultural competency, as demonstrated by evidence in Attachment \"CB Developer Experience\" of at least two (2) of the following:"]
[null,null,"(1)","Receipt of grant funds for services within the relevant community."]
[null,null,"(2)","Bilingual staff members that provide daily language assistance during the entity’s delivery of services to the relevant community."]
[null,null,"(3)","A record of hiring within the community."]
[null,null,"(4)","Membership in or recruitment from a local Urban League (or substantially equivalent) organization."]
[null,"File Name:",null,null,{"$f":"'Document Checklist-Full List'!$B$35","v":"09. CB Developer Experience"},null,null,null,null,null,null,null,null,{"$f":"'Document Checklist-Full List'!$K$35","v":"Provide documentation of all requirements for \"Community-Based Developer\" listed in Appendix A – Defined Terms and as indicated in (a)-(f) above."},null,null,null,null,null,null,null,null,null,null,null,null,null,null,null,null,null,"Uploaded to HCD?"]
[]
[null,{"$f":"IF(AND(vmIsCalhome=\"Yes\",vmIsJSerna=\"Yes\"),\"CALHOME and FWHG\",IF(vmIsCalhome=\"Yes\",\"CALHOME\",IF(vmIsJSerna=\"Yes\",\"FWHG\")))","v":false}]
[null,"ARTICLE II. GENERAL PROGRAM REQUIREMENTS"]
[null,"§203 Eligible Households"]
[null,null,"The Applicant acknowledges \"Eligible Households\" requirements therein §203?"]
[]
[null,"§204 Local Program/Project Administration"]
[null,null,"The Applicant acknowledges and certifies to implement the Local Program or project and be responsible for the following activities therein §204?"]
[null,null,"(b)","The Recipient shall adopt a written nondiscrimination policy requiring that no person shall, on the grounds of race, color, religion, sex, gender, gender identity, gender expression, sexual orientation, marital status, national origin, ancestry, familial status, source of income, disability, age, medical condition, genetic information, citizenship, primary language, immigration status (except where explicitly prohibited by federal law), arbitrary characteristics, and all other classes of individuals protected from discrimination under federal or state fair housing laws, individuals perceived to be a member of any of the preceding classes, or any individual or person associated with any of the preceding classes be excluded from participation in, be denied the benefits of, or be subjected to discrimination under, any program or activity funded in whole or in part with Program funds. "]
[null,null,null,"(1)","Notwithstanding the foregoing and subparagraph (c) below, a Tribal Entity Recipient may implement a preference for Tribal Households in connection with any Eligible Activities undertaken within Indian Country in accordance with applicable law."]
[null,null,null,"(2)","A Tribal Entity Recipient may also implement a tribal preference for procurement in connection with any Eligible Activities undertaken within Indian Country in accordance with applicable law. The Tribal Entity Recipient’s procurement policy shall be subject to the Department’s review and prior written approval."]
[null,null,null,null,"Will the Tribal Entity Recipient implement a tribal preference for procurement in connection with any Eligible Activities undertaken within Indian Country in accordance with applicable law"]
[null,"File Name:",null,null,{"$f":"'Document Checklist-Full List'!$B$36","v":"10. Nondiscrimination policy "},null,null,null,null,null,null,null,null,{"$f":"'Document Checklist-Full List'!$K$36","v":"Recipient, provide a copy of your adopted written nondiscrimination policy."},null,null,null,null,null,null,null,null,null,null,null,null,null,null,null,null,null,"Uploaded to HCD?"]
[null,"File Name:",null,null,{"$f":"'Document Checklist-Full List'!$B$37","v":"11. Procurement preference"},null,null,null,null,null,null,null,null,{"$f":"'Document Checklist-Full List'!$K$37","v":"Provide a copy of the Tribal Entity Recipient’s procurement policy."},null,null,null,null,null,null,null,null,null,null,null,null,null,null,null,null,null,"Uploaded to HCD?"]
[]
[null,"§205 Homebuyer Education Requirements"]
[null,null,"The Applicant acknowledges and certifies to implement the Local Program and be responsible for the following activities therein §205?"]
[null,null,"(1)","Homebuyer Education curriculum shall be pre-approved by the Department and, at a minimum, shall include the following topics:"]
[null,null,null,"(A)","Preparing for Homeownership;"]
[null,null,null,"(B)","Available financing and credit analysis;"]
[null,null,null,"(C)","Loan closing and homebuyer responsibilities;"]
[null,null,null,"(D)","Home maintenance and Loan servicing."]
[null,"File Name:",null,null,{"$f":"'Document Checklist-Full List'!$B$38","v":"12. Education curriculum "},null,null,null,null,null,null,null,null,{"$f":"'Document Checklist-Full List'!$K$38","v":"Provide a copy of the \"Homebuyer Education curriculum\"."},null,null,null,null,null,null,null,null,null,null,null,null,null,null,null,null,null,"Uploaded to HCD?"]
[]
[null,"§206 Loan Servicing Requirements"]
[null,null,"The Applicant acknowledges and certifies to develop and employ a Loan servicing plan that has been submitted to and approved by the Department as addressing the topics therein §206(a-c)?"]
[null,"File Name:",null,null,{"$f":"'Document Checklist-Full List'!$B$39","v":"13. Loan servicing plan"},null,null,null,null,null,null,null,null,{"$f":"'Document Checklist-Full List'!$K$39","v":"Recipients shall develop and employ a Loan servicing plan addressing the topics therein §206."},null,null,null,null,null,null,null,null,null,null,null,null,null,null,null,null,null,"Uploaded to HCD?"]
[]
[null,"§207 Reuse Account Requirements"]
[null,null,"The Applicant acknowledges and certifies to develop and employ a Reuse Account plan that has been submitted to and approved by the Department as addressing the following topics?"]
[null,null,"(1)","Description of a tracking system to ensure the reuse of funds for Eligible Activities including:"]
[null,null,null,"(A)","Loans to individual homeowners and homebuyers,"]
[null,null,null,"(B)","Homebuyer Education and"]
[null,null,null,"(C)","Allowable 5 percent Loan servicing fee."]
[null,"File Name:",null,null,"Reuse account plan",null,null,null,null,null,null,null,null,"Provide a copy of your reuse account plan.",null,null,null,null,null,null,null,null,null,null,null,null,null,null,null,null,null,"Uploaded to HCD?"]
[]
[null,"§209 State and Federal Laws, Rules, Guidelines and Regulations"]
[null,"The Applicant certify to comply with all applicable local, state, and federal laws, constitutions, codes, standards, rules, guidelines, and regulations, including, without limitation, those that pertain to accessibility, construction, health and safety, labor, fair housing, fair employment practices, affirmatively furthering fair housing, nondiscrimination, and equal opportunity except as provided in these Guidelines with respect to projects located within Indian Country?"]
[null,null,"(a)","Relocation Requirements."]
[null,null,null,"(1)","The Developer of a Homeownership Development Project resulting in displacement of persons, businesses or farm operations shall be solely responsible for providing the assistance and benefits set forth in this section and in applicable state and federal law and shall agree to indemnify and hold harmless the Department from any liabilities or claims for relocation-related costs."]
[null,null,null,null,"Does the proposed Project trigger State Relocation Assistance Law?"]
[null,null,null,null,"Are costs sufficient, pursuant to the relocation plan and included in the Project's Development Budget?"]
[null,"File Name:",null,null,{"$f":"'Document Checklist-Full List'!$B$41","v":"15. Relocation Plan"},null,null,null,null,null,null,null,null,{"$f":"'Document Checklist-Full List'!$K$41","v":"Submit a Relocation Plan"},null,null,null,null,null,null,null,null,null,null,null,null,null,null,null,null,null,"Uploaded to HCD?"]
[null,"Provide a narrative explanation, in the box below, supporting why relocation is not required. \"N/A\" or \"Vacant Land\" is not sufficient. "]
[]
[null,null,"(b)","Shared Parking. Developers of Homeownership Development Project Loans shall examine the feasibility of shared parking agreements to replace new parking construction or limit the number of new parking spaces that will be constructed. These requirements do not apply to proposals located on land owned or leased by the state (Gov. Code, § 65863.1, subd. (j)). An examination of the feasibility of shared parking shall include, at a minimum, identification of parking facilities on contiguous properties or nearby properties that would not require users to cross a street and then consideration of the apparent availability of those facilities for shared parking. (Government Code 65863.1(i)). The examination of the feasibility of shared parking shall be submitted to the Department prior to the execution and approval of the Standard Agreement. Tribal Entities are not required to examine the feasibility of shared parking for Homeownership Development Projects located in Indian Country where an Indian tribe exercises jurisdiction."]
[null,"File Name:",null,null,{"$f":"'Document Checklist-Full List'!$B$42","v":"16. Shared Parking examination"},null,null,null,null,null,null,null,null,{"$f":"'Document Checklist-Full List'!$K$42","v":"An examination of the feasibility of shared parking shall include, at a minimum, identification of parking facilities on contiguous properties or nearby properties that would not require users to cross a street and then consideration of the apparent availability of those facilities for shared parking. (Government Code 65863.1(i)). If not provided at Application due date, examination of the shared parking shall be submitted to the Department prior to the execution and approval of the Standard Agreement."},null,null,null,null,null,null,null,null,null,null,null,null,null,null,null,null,null,"Uploaded to HCD?"]
[]
[null,"ARTICLE III. HOMEOWNERSHIP/HOMEBUYER LOAN REQUIREMENTS"]
[null,"§300 Maximum Homeowner/Homebuyer Loan amounts"]
[null,null,"Applicant acknowledges and certifies to follow the requirements therein §300?"]
[]
[null,"§301 Homeowner/Homebuyer Loan terms"]
[null,null,"Applicant acknowledges and certifies to follow the requirements therein §301?"]
[]
[null,"§302 Homeowner/Homebuyer Loan-to-Value Limits"]
[null,null,"Applicant acknowledges and certifies to follow the requirements therein §302?"]
[]
[null,"ARTICLE IV. PROGRAM REQUIREMENTS"]
[null,"§400 Homeownership Development Project Loan "]
[null,"§400.2 Eligible Costs"]
[null,null,"Applicant acknowledges and certifies to follow the requirements therein §400.2?"]
[]
[null,"§400.3 Site Control"]
[null,"To be eligible to apply for a Homeownership Development Project Loan, the Applicant shall have site control of the proposed Project property through the application Award date listed in the NOFA, as evidenced by the following:"]
[]
[null,"FWHG HDPL - At time of application, does Sponsor/Applicant, or its wholly controlled affiliate have site control pursuant to §400.3?"]
[null,"Type of site control:",null,null,null,null,null,null,null,null,null,null,null,null,null,null,"Date",null,null,"Expires",null,null,"Extensions Available",null,null,null,null,null,null,"Purchase Price",null,null,null,null,"Total Land Area"]
[null,null,null,null,null,null,null,null,null,null,null,null,null,null,null,null,null,null,null,null,null,null,null,null,null,null,null,null,null,null,null,null,null,null,null,null,null,"acres"]
[]
[null,"Current owner",null,null,null,null,null,null,null,null,null,null,null,null,null,null,"Project site address",null,null,null,null,null,null,null,null,null,null,"City",null,null,null,null,null,"State",null,null,"Zip code"]
[]
[null,"Below, provide details for unusual site control special circumstances, and for applications with multiple or non-contiguous parcels, scattered sites, lot line adjustments, air rights parceling, phased projects, or other complex land transactions, including unique value calculations and explanations as applicable:"]
[]
[null,"Planned and completed property transfer(s). ",null,null,null,null,null,null,null,null,null,null,"Ground Lease planned?"]
[null,"Lessor",null,null,null,null,null,null,null,null,null,null,null,null,null,null,null,null,null,null,"Term",null,null,null,null,null,null,null,null,null,null,null,null,null,"Annual Payment"]
[]
[null,"Below, describe property transfers occurring in connection with development of the Project."]
[]
[null,"File Name:",null,null,{"$f":"'Document Checklist-Full List'!$B$43","v":"17. FWHG Site Control"},null,null,null,null,null,null,null,null,{"$f":"'Document Checklist-Full List'!$K$43","v":"Documentation of site control in accordance with §400.3, including a summary explanation of site control and values for applications with multiple or non-contiguous parcels, scattered sites, lot line adjustments, phased projects, or other complex land and acquisition transactions."},null,null,null,null,null,null,null,null,null,null,null,null,null,null,null,null,null,"Uploaded to HCD Portal?"]
[null,"File Name:",null,null,{"$f":"'Document Checklist-Full List'!$B$44","v":"18. FWHG Preliminary Title Report"},null,null,null,null,null,null,null,null,{"$f":"'Document Checklist-Full List'!$K$44","v":"Provide a preliminary report dated within 30 days of application due date. For projects developed in Indian country, an attorney’s opinion regarding chain of title and current title status is acceptable in lieu of a title report."},null,null,null,null,null,null,null,null,null,null,null,null,null,null,null,null,null,"Uploaded to HCD Portal?"]
[null,"File Name:",null,null,{"$f":"'Document Checklist-Full List'!$B$45","v":"19. FWHG Appraisal"},null,null,null,null,null,null,null,null,{"$f":"'Document Checklist-Full List'!$K$45","v":"If land cost or value is included in the development budget, an appraisal report supporting the cost or value is required. "},null,null,null,null,null,null,null,null,null,null,null,null,null,null,null,null,null,"Uploaded to HCD Portal?"]
[]
[null,"CalHome HDPL - At time of application, does Sponsor/Applicant, or its wholly controlled affiliate have site control pursuant to §400.3?"]
[null,"Type of site control:",null,null,null,null,null,null,null,null,null,null,null,null,null,null,"Date",null,null,"Expires",null,null,"Extensions Available",null,null,null,null,null,null,"Purchase Price",null,null,null,null,"Total Land Area"]
[null,null,null,null,null,null,null,null,null,null,null,null,null,null,null,null,null,null,null,null,null,null,null,null,null,null,null,null,null,null,null,null,null,null,null,null,null,"acres"]
[]
[null,"Current owner",null,null,null,null,null,null,null,null,null,null,null,null,null,null,"Project site address",null,null,null,null,null,null,null,null,null,null,"City",null,null,null,null,null,"State",null,null,"Zip code"]
[]
[null,"Below, provide details for unusual site control special circumstances, and for applications with multiple or non-contiguous parcels, scattered sites, lot line adjustments, air rights parceling, phased projects, or other complex land transactions, including unique value calculations and explanations as applicable:"]
[]
[null,"Planned and completed property transfer(s). ",null,null,null,null,null,null,null,null,null,null,"Ground Lease planned?"]
[null,"Lessor",null,null,null,null,null,null,null,null,null,null,null,null,null,null,null,null,null,null,"Term",null,null,null,null,null,null,null,null,null,null,null,null,null,"Annual Payment"]
[]
[null,"Below, describe property transfers occurring in connection with development of the Project."]
[]
[null,"File Name:",null,null,{"$f":"'Document Checklist-Full List'!$B$46","v":"20. Calhome Site Control"},null,null,null,null,null,null,null,null,{"$f":"'Document Checklist-Full List'!$K$46","v":"Documentation of site control in accordance with §400.3, including a summary explanation of site control and values for applications with multiple or non-contiguous parcels, scattered sites, lot line adjustments, phased projects, or other complex land and acquisition transactions."},null,null,null,null,null,null,null,null,null,null,null,null,null,null,null,null,null,"Uploaded to HCD Portal?"]
[null,"File Name:",null,null,{"$f":"'Document Checklist-Full List'!$B$47","v":"21. Calhome Preliminary Title Report"},null,null,null,null,null,null,null,null,{"$f":"'Document Checklist-Full List'!$K$47","v":"Provide a preliminary report dated within 30 days of application due date. For projects developed in Indian country, an attorney’s opinion regarding chain of title and current title status is acceptable in lieu of a title report."},null,null,null,null,null,null,null,null,null,null,null,null,null,null,null,null,null,"Uploaded to HCD Portal?"]
[null,"File Name:",null,null,{"$f":"'Document Checklist-Full List'!$B$48","v":"22. Calhome Appraisal"},null,null,null,null,null,null,null,null,{"$f":"'Document Checklist-Full List'!$K$48","v":"If land cost or value is included in the development budget, an appraisal report supporting the cost or value is required. "},null,null,null,null,null,null,null,null,null,null,null,null,null,null,null,null,null,"Uploaded to HCD Portal?"]
[]
[null,"§400.4 Maximum Homeownership Development Project Loan Amount"]
[null,null,"Applicant acknowledges that the maximum Homeownership Development Project Loan amount is published in the current NOFA?"]
[]
[null,"§400.5 Homeownership Development Project Loan Terms"]
[null,null,"Applicant acknowledges and certifies to follow the requirements therein §400.5?"]
[]
[null,"§400.6 Homeownership Development Project Loan-to-Value Limits"]
[null,null,"Applicant acknowledges and certifies to follow the requirements therein §400.6?"]
[]
[null,"§400.7 Homeownership Development Project Requirements"]
[null,null,"Applicant acknowledges and certifies to follow the requirements therein §400.7?"]
[]
[null,"§401 Self-Help Technical Assistance Project"]
[null,"§401.2 Eligible Costs"]
[null,null,"Applicant acknowledges and certifies to follow the requirements therein §401.2?"]
[]
[null,"§401.3 Self-Help Technical Assistance Administrative Requirements"]
[null,null,"Applicant acknowledges and certifies to follow the requirements therein §401.3?"]
[null,"File Name:",null,null,{"$f":"'Document Checklist-Full List'!$B$49","v":"23. SHTA program guidelines"},null,null,null,null,null,null,null,null,{"$f":"'Document Checklist-Full List'!$K$49","v":"The Recipient shall develop and employ Self-Help Technical Assistance Program guidelines submitted to and approved by the Department as addressing the topics therein  §401.3."},null,null,null,null,null,null,null,null,null,null,null,null,null,null,null,null,null,"Uploaded to HCD Portal?"]
[]
[]
[null,"§402 Mortgage Assistance Program"]
[null,"§402.2 Eligible Costs"]
[null,null,"Applicant acknowledges and certifies to follow the requirements therein §402.2?"]
[]
[null,"§402.3 Administrative Requirements"]
[null,null,"Applicant acknowledges and certifies to follow the requirements therein §402.3?"]
[]
[null,"§402.4 Underwriting Requirements"]
[null,null,"Applicant acknowledges and certifies to follow the requirements therein §402.4?"]
[null,"File Name:",null,null,{"$f":"'Document Checklist-Full List'!$B$50","v":"24. MA Program Underwriting Guidelines "},null,null,null,null,null,null,null,null,{"$f":"'Document Checklist-Full List'!$K$50","v":"Program Recipients shall develop and employ Mortgage Assistance Program Underwriting Guidelines that have been submitted to and approved by the Department."},null,null,null,null,null,null,null,null,null,null,null,null,null,null,null,null,null,"Uploaded to HCD Portal?"]
[]
[null,"§403 Owner-Occupied Rehabilitation"]
[null,"§403.2 Eligible Costs"]
[null,null,"Applicant acknowledges and certifies to follow the requirements therein §403.2?"]
[]
[null,"§403.3 Administrative Requirements"]
[null,null,"Applicant acknowledges and certifies to follow the requirements therein §403.3?"]
[]
[null,"§403.4 Owner-Occupied Underwriting and Construction Requirements"]
[null,null,"Applicant acknowledges and certifies to follow the requirements therein §403.4?"]
[null,"File Name:",null,null,{"$f":"'Document Checklist-Full List'!$B$51","v":"25. OOR Underwriting and Construction Requirements"},null,null,null,null,null,null,null,null,{"$f":"'Document Checklist-Full List'!$K$51","v":"Program Recipients shall develop and employ Owner-Occupied Rehabilitation Program Guidelines submitted to and approved by the Department."},null,null,null,null,null,null,null,null,null,null,null,null,null,null,null,null,null,"Uploaded to HCD Portal?"]
[]
[null,"§404 Shared Housing Programs"]
[null,"§404.2 Eligible Costs"]
[null,null,"Applicant acknowledges and certifies to follow the requirements therein §404.2?"]
[]
[null,"§404.3 Administrative Requirements"]
[null,null,"Applicant acknowledges and certifies to follow the requirements therein §404.3?"]
[]
[null,"§404 Acquisition of Manufactured Housing Grant Program"]
[null,"§404.2 Eligible Costs"]
[null,null,"Applicant acknowledges and certifies to follow the requirements therein §404.2?"]
[]
[null,"§404.3 Administrative Requirements"]
[null,null,"Applicant acknowledges and certifies to follow the requirements therein §404.3?"]
[]
[null,"§404.4 Underwriting and Loan Requirements"]
[null,null,"Applicant acknowledges and certifies to follow the requirements therein §404.4?"]
[]
[null,"§405 ADU/JADU Programs"]
[null,"§405.2 Eligible Costs"]
[null,null,"Applicant acknowledges and certifies to follow the requirements therein §405.2?"]
[]
[null,"§405.3 ADU/JADU Programs Administration Requirements"]
[null,null,"Applicant acknowledges and certifies to follow the requirements therein §405.3?"]
[]
[null,"§405.4 ADU/JADU Programs Underwriting and Construction Requirements"]
[null,null,"Applicant acknowledges and certifies to follow the requirements therein §405.4?"]
[null,"File Name:",null,null,{"$f":"'Document Checklist-Full List'!$B$52","v":"26. ADU-JADU Underwriting and Construction Requirements"},null,null,null,null,null,null,null,null,{"$f":"'Document Checklist-Full List'!$K$52","v":"Recipients shall develop and employ ADU/JADU Program Guidelines submitted to and approved by the Department addressing the following topics there in Section 405.4"},null,null,null,null,null,null,null,null,null,null,null,null,null,null,null,null,null,"Uploaded to HCD Portal?"]
[]
[null,"ARTICLE V. APPLICATION PROCEDURES"]
[null,"§500 Application Process"]
[null,null,"Applicant acknowledges and understand the \"Application process\" therein §500?"]
[]
[null,"§501 Application Requirements"]
[null,null,"Applicant acknowledges and understand the \"Application Requirements\" therein §501?"]
[]
[null,"§502 Selection Process"]
[null,null,"Applicant acknowledges and understand the \"Selection Process\" therein §502?"]
[]
[null,"§503 Appeals Process"]
[null,null,"Applicant acknowledges and understand the \"Appeals Process\" therein §503?"]
[]
[null,"ARTICLE VI. PROGRAM OPERATIONS"]
[null,"§600 Legal Documents"]
[null,null,"Applicant acknowledges and understand the \"Legal Documents\" therein §600?"]
[]
[null,"§601 Disbursement of Loan and Grant Funds"]
[null,null,"Applicant acknowledges and understand the \"Disbursement of Loan and Grant Funds\" therein §601?"]
[]
[null,"§602 Reporting Requirements"]
[null,null,"Applicant acknowledges and understand the \"Reporting Requirements\" therein §602?"]
[]
[null,"§603 Performance Goals"]
[null,null,"Applicant acknowledges and understand the \"Performance Goals\" therein §603?"]
[]
[null,"§604 Defaults and Loan Cancellations"]
[null,null,"Applicant acknowledges and understand the \"Defaults and Loan Cancellations\" therein §604?"]
[]
[null,"HDPL Milestones",null,null,null,null,null,null,null,null,null,null,null,null,null,null,null,null,null,null,null,null,null,null,null,null,null,null,"Completed",null,null,null,null,"Date (Expected / Completed)"]
[null,"Executed binding agreement between the Recipient and Developer of the Project detailing the terms and conditions of the Project development."]
[null,"Ultimate site control of Project site(s), if required."]
[null,"Completion necessary environmental clearances, including those required under CEQA."]
[null,"Completion necessary environmental clearances, complete NEPA if required."]
[null,"Obtaining all necessary and discretionary public land use approvals."]
[null,"Obtaining all construction Enforceable Funding Commitments."]
[null,"Obtaining all permanent Enforceable Funding Commitments including substantially final permanent loan documents, and tax credit syndication documents."]
[null,"Submission of final construction drawings and specifications to the appropriate local building department or permitting authority."]
[null,"Commencement of construction."]
[null,"Construction complete and the filing of the Notice of Completion."]
[]
[null,"Applicant Notes/Comments"]
[]
[]
[]
[]
[null,"End of Document"]

{"sheet":"HDPL Unit Mix","index":6,"n_rows":22,"n_cols":11,"rows_kept":22,"cut":false,"hidden":true,"merged":[[21,1,21,10],[1,6,1,7],[0,1,0,6],[1,1,1,5],[17,1,17,3],[18,1,18,10]]}
[]
[null,"NOFA (II)(b)(1)(a)(i) Homeownership Development Projects must have a minimum of five (5) units.",null,null,null,null,"HCD Assisted Units"]
[null,"# of Bedrooms","# of Baths","% of Area Median Income ","Square footage\n(living spaces)","Total Units","CalHome","FWHG","Est. per unit construction costs","Est. Sales Price","Provide the data source used to set sales price"]
[]
[]
[]
[]
[]
[]
[]
[]
[]
[]
[]
[]
[null,null,null,null,null,{"$f":"SUM(F4:F15)","v":0},{"$f":"SUM(G4:G15)","v":0},{"$f":"SUM(H4:H15)","v":0}]
[]
[null,"Applicant Notes/Comments"]
[]
[]
[]
[null,"End of Document"]

{"sheet":"Grant-Loan Amount","index":7,"n_rows":33,"n_cols":51,"rows_kept":33,"cut":false,"hidden":true,"merged":[[27,59,27,60],[28,59,28,60],[22,50,22,52],[23,50,23,52],[24,50,24,52],[27,50,27,56],[19,50,19,52],[20,50,20,52],[21,50,21,52],[22,42,22,44],[24,1,24,8],[15,50,15,56],[17,46,17,48],[18,46,18,48],[19,46,19,48],[20,46,20,48],[17,50,17,52],[18,50,18,52],[15,42,15,48],[17,42,17,44],[18,42,18,44],[19,42,19,44],[21,42,21,44],[20,22,20,24],[21,22,21,24],[18,22,18,24],[22,22,22,24],[23,22,23,24],[23,42,23,44],[24,42,24,44],[23,46,23,48],[24,46,24,48],[23,18,23,20],[30,1,30,40],[27,25,27,41],[24,18,24,20],[24,26,24,28],[24,30,24,32],[24,22,24,24],[24,10,24,12],[24,14,24,16],[23,30,23,32],[23,10,23,12],[23,26,23,28],[18,34,18,36],[32,1,32,56],[20,38,20,40],[21,38,21,40],[22,38,22,40],[23,38,23,40],[24,38,24,40],[20,34,20,36],[21,34,21,36],[22,34,22,36],[23,34,23,36],[24,34,24,36],[21,46,21,48],[22,46,22,48],[27,42,27,48],[20,42,20,44],[21,1,21,8],[29,1,29,8],[23,1,23,8],[19,10,19,12],[19,14,19,16],[19,22,19,24],[23,14,23,16],[9,24,9,27],[9,29,9,32],[9,33,9,36],[10,1,10,12],[15,10,15,16],[17,10,17,12],[17,14,17,16],[17,1,17,8],[10,33,10,36],[15,34,15,40],[17,38,17,40],[17,34,17,36],[17,18,17,20],[17,22,17,24],[10,14,10,23],[10,24,10,27],[10,29,10,32],[15,26,15,32],[17,26,17,28],[17,30,17,32],[11,1,11,36],[12,1,12,36],[13,1,13,36],[9,14,9,23],[21,10,21,12],[21,14,21,16],[21,18,21,20],[20,10,20,12],[20,14,20,16],[20,1,20,8],[22,1,22,8],[22,10,22,12],[22,14,22,16],[22,18,22,20],[18,30,18,32],[19,30,19,32],[20,30,20,32],[21,30,21,32],[22,30,22,32],[18,14,18,16],[19,26,19,28],[20,26,20,28],[18,26,18,28],[21,26,21,28],[20,18,20,20],[19,18,19,20],[22,26,22,28],[18,10,18,12],[18,38,18,40],[19,34,19,36],[19,38,19,40],[15,18,15,24],[18,18,18,20],[12,37,12,38],[3,1,3,36],[4,1,4,36],[6,1,6,36],[8,14,8,23],[8,24,8,27],[8,29,8,32],[8,33,8,36],[5,37,5,38],[5,1,5,11],[5,12,5,21],[7,1,7,12],[8,1,8,12],[4,37,4,38],[18,1,18,8],[19,1,19,8],[13,37,13,38],[9,1,9,12]]}
[]
[null,"Maximum Loan / Grant Amount"]
[]
[null,"NOFA (II)(D)(1)(a) Mobilehome or Manufactured Home Assistance: To the extent there are eligible applications, the Department shall target $27 million of the available $143.1 million in CalHome funds as Awards for Mobilehome or Manufactured Home assistance. To the extent there is insufficient demand of eligible applications to make $27 million in Awards, any remaining funds will be applied to the general pool of Applicants."]
[null,"Will the Applicant use CalHome funds for Mobilehome assistance in a Mobilehome park or Manufactured home community?"]
[null,"Applicant certifies that CalHome funds will be used for",null,null,null,null,null,null,null,null,null,null,null,null,null,null,null,null,null,null,null,null,"?"]
[null,"If \"Both\", of the maximum application amount in column AQ (in this sheet) for the program activity, how much funds will be used for Mobilehome or Manufactured Home Assistance?"]
[null,"Program Activity"]
[null,null,null,null,null,null,null,null,null,null,null,null,null,null," Manufactured home community",null,null,null,null,null,null,null,null,null,null,null,null,null,null,"Mobilehome"]
[null,null,null,null,null,null,null,null,null,null,null,null,null,null," Manufactured home community",null,null,null,null,null,null,null,null,null,null,null,null,null,null,"Mobilehome"]
[null,null,null,null,null,null,null,null,null,null,null,null,null,null," Manufactured home community",null,null,null,null,null,null,null,null,null,null,null,null,null,null,"Mobilehome"]
[null,"NOFA (II)(D)(1)(b) Community-Based Developer: To the extent that there are eligible applications, the Department shall target 15 percent of HOSN funds (i.e., $26.5 million) to Community-Based Developers applying for a Homeownership Development Project Loan and/or a Self-Help Technical Assistance Grant. This shall include 15 percent of the total CalHome funds available under the HOSN (i.e., $21.5 million) and 15 percent of the total Serna funds available under the HOSN (i.e., $5 million)."]
[null,"Is the Applicant a Community-Based Developer applying for a Homeownership Development Project Loan and/or a Self-Help Technical Assistance Grant.",null,null,null,null,null,null,null,null,null,null,null,null,null,null,null,null,null,null,null,null,null,null,null,null,null,null,null,null,null,null,null,null,null,null,null,{"$f":"IF(AND(OR(IsCalhome,IsJSerna),vmCBD=\"Yes\"),TRUE,FALSE)","v":false}]
[null,"NOFA (II)(C)(2)(a)(i) Will the Mortgage Assistance be provided as part of a Homeownership Development Project Loan?"]
[]
[null,null,null,null,null,null,null,null,null,null,"Assisting Units",null,null,null,null,null,null,null,"Requesting Amount",null,null,null,null,null,null,null,"Homebuyer Education",null,null,null,null,null,null,null,"Administrative Costs",null,null,null,null,null,null,null,"NOFA (II)(c)(1)",null,null,null,null,null,null,null,"NOFA (II)(c)(1)"]
[]
[null,"Program Activities",null,null,null,null,null,null,null,null,"CalHome",null,null,null,"FWHG",null,null,null,"CalHome",null,null,null,"FWHG",null,null,null,"CalHome",null,null,null,"FWHG",null,null,null,"CalHome",null,null,null,"FWHG",null,null,null,"CalHome",null,null,null,"FWHG",null,null,null,"CalHome"]
[null,"Homeownership Development Project Loans",null,null,null,null,null,null,null,null,{"$f":"'HDPL Unit Mix'!$G$16","v":0},null,null,null,{"$f":"'HDPL Unit Mix'!$H$16","v":0},null,null,null,null,null,null,null,null,null,null,null,"N/A",null,null,null,"N/A",null,null,null,"N/A",null,null,null,"N/A",null,null,null,{"$f":"IF(AND(NOT(IsCalhomeTribal),IsCalhome,IsHDPL),MIN($K$19*250000,$S$19),0)","v":0},null,null,null,{"$f":"IF(AND(IsJSerna,vmIsJHDPL),MIN($O$19*250000,W19),0)","v":0},null,null,null,{"$f":"IF(AND(IsCalhomeTribal,IsCalhome,IsHDPL),MIN($K$19*250000,$S$19),0)","v":0}]
[null,"Self-Help Technical Assistance Grants",null,null,null,null,null,null,null,null,null,null,null,null,null,null,null,null,null,null,null,null,null,null,null,null,{"$f":"K20*250","v":0},null,null,null,{"$f":"O20*250","v":0},null,null,null,"N/A",null,null,null,"N/A",null,null,null,{"$f":"IF(AND(NOT(IsCalhomeTribal),IsCalhome,IsSHTA),MIN($K$20*20000,S20)+$AA$20,0)","v":0},null,null,null,{"$f":"IF(AND(IsJSerna,vmIsJSHTA),MIN($O$20*20000,W20)+$AE$20,0)","v":0},null,null,null,{"$f":"IF(AND(IsCalhomeTribal,IsCalhome,IsSHTA),MIN($K$20*20000,S20),0)","v":0}]
[null,"Mortgage Assistance Grants",null,null,null,null,null,null,null,null,null,null,null,null,null,null,null,null,null,null,null,null,null,null,null,null,{"$f":"K21*250","v":0},null,null,null,{"$f":"O21*250","v":0},null,null,null,{"$f":"IF(AND($AL$14,IsCalhome),MIN($K$21*250000,$S$21)*0.1,IF(AND($AL$14=FALSE,IsCalhome),MIN($K$21*200000,$S$21)*0.1,0))","v":0},null,null,null,{"$f":"IF(AND($AL$14,IsJSerna),MIN($O$21*250000,$W$21)*0.1,IF(AND($AL$14=FALSE,IsJSerna),MIN($O$21*200000,$W$21)*0.1,0))","v":0},null,null,null,{"$f":"IF(AND(NOT(IsCalhomeTribal),$AL$14,IsCalhome,IsMA),MIN(SUM($K$21*250000,$AA$21,$AI$21),SUM($S$21,$AA$21,$AI$21)),IF(AND(NOT(IsCalhomeTribal),$AL$14=FALSE,IsCalhome,IsMA),MIN(SUM($K$21*200000,$AA$21,$AI$21),SUM($S$21,$AA$21,$AI$21)),0))","v":0},null,null,null,{"$f":"IF(AND($AL$14,IsJSerna,vmIsJMA),MIN(SUM($O$21*250000,$AE$21,$AM$21),SUM($W$21,$AE$21,$AM$21,)),IF(AND($AL$14=FALSE,IsJSerna,vmIsJMA),MIN(SUM($O$21*200000,$AE$21,$AM$21),SUM($W$21,$AE$21,$AM$21)),0))","v":0},null,null,null,{"$f":"IF(AND(IsCalhomeTribal,$AL$14,IsCalhome,IsMA),MIN(SUM($K$21*250000,$AI$21),SUM($S$21,$AI$21)),IF(AND(IsCalhomeTribal,$AL$14=FALSE,IsCalhome,IsMA),MIN(SUM($K$21*200000,$AI$21),SUM($S$21,$AI$21)),0))","v":0}]
[null,"Owner-Occupied Rehabilitation Grants",null,null,null,null,null,null,null,null,null,null,null,null,null,null,null,null,null,null,null,null,null,null,null,null,"N/A",null,null,null,"N/A",null,null,null,{"$f":"IF(IsCalhome,MIN($K$22*250000,$S$22)*0.2,0)","v":0},null,null,null,{"$f":"IF(IsJSerna,MIN($O$22*250000,$W$22)*0.2,0)","v":0},null,null,null,{"$f":"IF(AND(NOT(IsCalhomeTribal),IsCalhome,IsOOR),MIN($K$22*250000,$S$22)+AI22,0)","v":0},null,null,null,{"$f":"IF(AND(IsJSerna,vmIsJOOR),MIN($O$22*250000,$W$22)+AM22,0)","v":0},null,null,null,{"$f":"IF(AND(IsCalhomeTribal,IsCalhome,IsOOR),MIN($K$22*200000,$S$22)+AI22,0)","v":0}]
[null,"Shared Housing Grants",null,null,null,null,null,null,null,null,"N/A",null,null,null,"N/A",null,null,null,null,null,null,null,"N/A",null,null,null,"N/A",null,null,null,"N/A",null,null,null,"N/A",null,null,null,"N/A",null,null,null,{"$f":"IF(AND(NOT(IsCalhomeTribal),IsCalhome,IsSH,S23=0),0,IF(AND(NOT(IsCalhomeTribal),IsCalhome,IsSH),MIN(300000,S23),0))","v":0},null,null,null,"N/A",null,null,null,{"$f":"IF(AND(IsCalhomeTribal,IsCalhome,IsSH,S23=0),0,IF(AND(IsCalhomeTribal,IsCalhome,IsSH),MIN(300000,S23),0))","v":0}]
[null,"Accessory Dwelling Units/Junior Accessory Dwelling Units Grants",null,null,null,null,null,null,null,null,null,null,null,null,"N/A",null,null,null,null,null,null,null,"N/A",null,null,null,"N/A",null,null,null,"N/A",null,null,null,{"$f":"IF(IsCalhome,MIN($K$24*250000,$S$24)*0.2,0)","v":0},null,null,null,"N/A",null,null,null,{"$f":"IF(AND(NOT(IsCalhomeTribal),IsCalhome,IsJADU),MIN($K$24*250000,$S$24)+AI24,0)","v":0},null,null,null,"N/A",null,null,null,{"$f":"IF(AND(IsCalhomeTribal,IsCalhome,IsJADU),MIN($K$24*250000,$S$24)+AI24,0)","v":0}]
[null,"Acquisition of Manufactured Housing Grants",null,null,null,null,null,null,null,null,"N/A",null,null,null,null,null,null,null,"N/A",null,null,null,null,null,null,null,"N/A",null,null,null,"N/A",null,null,null,"N/A",null,null,null,{"$f":"IF(IsJSerna,MIN($O$25*150000,$W$25)*0.2,0)","v":0},null,null,null,"N/A",null,null,null,{"$f":"IF(AND(IsJSerna,vmIsJAMH),MIN($O$25*150000,$W$25)+AM25,0)","v":0},null,null,null,"N/A"]
[]
[]
[null,null,null,null,null,null,null,null,null,null,null,null,null,null,null,null,null,null,null,null,null,null,null,null,null,"Total max Application amount:",null,null,null,null,null,null,null,null,null,null,null,null,null,null,null,null,{"$f":"SUM(AQ19:AS25,AU19:AW25)","v":0},null,null,null,null,null,null,null,{"$f":"SUM(AY19:BA25)","v":0}]
[]
[null,"Applicant Notes/Comments"]
[]
[]
[null,"End of Document"]

{"sheet":"HDPL Dev Sources","index":8,"n_rows":21,"n_cols":11,"rows_kept":21,"cut":false,"hidden":true,"merged":[[20,1,20,10],[1,8,2,10],[2,3,2,4],[1,2,2,2],[17,1,17,10],[18,1,18,10],[14,3,14,7],[14,8,14,9]]}
[]
[null,null,"HDPL Development Sources",null,null,null,null,null,"Construction Terms"]
[null,null,null,"Sources Totals",null,{"$f":"SUMIF(DevSourcesTbl[Committed?],\"Yes\",DevSourcesTbl[Residential Amount])","v":0},{"$f":"SUMIF(DevSourcesTbl[Committed?],\"Yes\",DevSourcesTbl[Commercial Amount])","v":0},{"$f":"SUM(F3,G3)","v":0}]
[null,"Committed?","Source Name (lien priority order)","Source Type","Lien No.","Residential Amount","Commercial Amount","Total Amount","Interest Rate","Required\nPayment ","Loan Term\n(months)"]
[null,null,"CalHome","State-HCD",null,null,null,{"$f":"SUM(DevSourcesTbl[[#This Row],[Residential Amount]],DevSourcesTbl[[#This Row],[Commercial Amount]])","v":0}]
[null,null,null,null,null,null,null,{"$f":"SUM(DevSourcesTbl[[#This Row],[Residential Amount]],DevSourcesTbl[[#This Row],[Commercial Amount]])","v":0}]
[null,null,null,null,null,null,null,{"$f":"SUM(DevSourcesTbl[[#This Row],[Residential Amount]],DevSourcesTbl[[#This Row],[Commercial Amount]])","v":0}]
[null,null,null,null,null,null,null,{"$f":"SUM(DevSourcesTbl[[#This Row],[Residential Amount]],DevSourcesTbl[[#This Row],[Commercial Amount]])","v":0}]
[null,null,null,null,null,null,null,{"$f":"SUM(DevSourcesTbl[[#This Row],[Residential Amount]],DevSourcesTbl[[#This Row],[Commercial Amount]])","v":0}]
[null,null,null,null,null,null,null,{"$f":"SUM(DevSourcesTbl[[#This Row],[Residential Amount]],DevSourcesTbl[[#This Row],[Commercial Amount]])","v":0}]
[null,null,null,null,null,null,null,{"$f":"SUM(DevSourcesTbl[[#This Row],[Residential Amount]],DevSourcesTbl[[#This Row],[Commercial Amount]])","v":0}]
[null,null,null,null,null,null,null,{"$f":"SUM(DevSourcesTbl[[#This Row],[Residential Amount]],DevSourcesTbl[[#This Row],[Commercial Amount]])","v":0}]
[null,null,null,null,null,null,null,{"$f":"SUM(DevSourcesTbl[[#This Row],[Residential Amount]],DevSourcesTbl[[#This Row],[Commercial Amount]])","v":0}]
[]
[null,"File Name:",{"$f":"'Document Checklist-Full List'!$B$55","v":"27. EFC #1, EFC #2, etc."},{"$f":"'Document Checklist-Full List'!$K$55","v":"Provide all commitment letters or other evidence documenting construction financing commitments."},null,null,null,null,"Uploaded to HCD?"]
[]
[]
[null,"Applicant comments: Include a description of balloon payments and unusual or extraordinary circumstances that have resulted in higher than expected Project costs and provide a justification as to why these costs are reasonable. "]
[]
[]
[null,"End of Document"]

{"sheet":"HDPL Dev Budget SU","index":9,"n_rows":84,"n_cols":16,"rows_kept":84,"cut":false,"hidden":true,"merged":[[83,1,83,15],[48,1,49,1],[1,14,1,15],[41,1,46,1],[35,1,39,1],[26,1,33,1],[13,1,24,1],[5,1,11,1],[3,0,3,1],[1,5,1,7],[58,1,62,1],[51,1,56,1],[81,2,81,6],[73,1,78,1],[64,1,71,1],[80,2,80,5]]}
[]
[null,null,"HDPL Projects",null,null,"Sources of Funds",null,null,null,null,null,null,null,null,"Commercial Sources"]
[null,null,"Grant Totals",{"$f":"SUM(DevBudgetSUTbl[Column2])-SUM($D$13,$D$26,$D$35,$D$41,$D$48,$D$51,$D$58,$D$64,$D$73)","v":0},{"$f":"SUM(DevBudgetSUTbl[Column3])-SUM($E$13,$E$26,$E$35,$E$41,$E$48,$E$51,$E$58,$E$64,$E$73)","v":0},{"$f":"SUM(DevBudgetSUTbl[Column89])-SUM($F$13,$F$26,$F$35,$F$41,$F$48,$F$51,$F$58,$F$64,$F$73)","v":0},{"$f":"SUM(DevBudgetSUTbl[Column15])-SUM($G$13,$G$26,$G$35,$G$41,$G$48,$G$51,$G$58,$G$64,$G$73)","v":0},{"$f":"SUM(DevBudgetSUTbl[Column18])-SUM($H$13,$H$26,$H$35,$H$41,$H$48,$H$51,$H$58,$H$64,$H$73)","v":0},{"$f":"SUM(DevBudgetSUTbl[Column19])-SUM($I$13,$I$26,$I$35,$I$41,$I$48,$I$51,$I$58,$I$64,$I$73)","v":0},{"$f":"SUM(DevBudgetSUTbl[Column22])-SUM($J$13,$J$26,$J$35,$J$41,$J$48,$J$51,$J$58,$J$64,$J$73)","v":0},{"$f":"SUM(DevBudgetSUTbl[Column23])-SUM($K$13,$K$26,$K$35,$K$41,$K$48,$K$51,$K$58,$K$64,$K$73)","v":0},{"$f":"SUM(DevBudgetSUTbl[Column24])-SUM($L$13,$L$26,$L$35,$L$41,$L$48,$L$51,$L$58,$L$64,$L$73)","v":0},{"$f":"SUM(DevBudgetSUTbl[Column25])-SUM($M$13,$M$26,$M$35,$M$41,$M$48,$M$51,$M$58,$M$64,$M$73)","v":0},{"$f":"SUM(DevBudgetSUTbl[Column26])-SUM($N$13,$N$26,$N$35,$N$41,$N$48,$N$51,$N$58,$N$64,$N$73)","v":0},{"$f":"SUM(DevBudgetSUTbl[Column33])-SUM($O$13,$O$26,$O$35,$O$41,$O$48,$O$51,$O$58,$O$64,$O$73)","v":0},{"$f":"SUM(DevBudgetSUTbl[Column34])-SUM($P$13,$P$26,$P$35,$P$41,$P$48,$P$51,$P$58,$P$64,$P$73)","v":0}]
[null,null,"USES OF FUNDS"," Total Project Cost/Sources","Total Project Commercial Cost/Sources",{"$f":"IF('HDPL Dev Sources'!$C5>0,'HDPL Dev Sources'!$C5,\"\")","v":"CalHome"},{"$f":"IF('HDPL Dev Sources'!$C6>0,'HDPL Dev Sources'!$C6,\"\")","v":""},{"$f":"IF('HDPL Dev Sources'!$C7>0,'HDPL Dev Sources'!$C7,\"\")","v":""},{"$f":"IF('HDPL Dev Sources'!$C8>0,'HDPL Dev Sources'!$C8,\"\")","v":""},{"$f":"IF('HDPL Dev Sources'!$C9>0,'HDPL Dev Sources'!$C9,\"\")","v":""},{"$f":"IF('HDPL Dev Sources'!$C10>0,'HDPL Dev Sources'!$C10,\"\")","v":""},{"$f":"IF('HDPL Dev Sources'!$C11>0,'HDPL Dev Sources'!$C11,\"\")","v":""},{"$f":"IF('HDPL Dev Sources'!$C12>0,'HDPL Dev Sources'!$C12,\"\")","v":""},{"$f":"IF('HDPL Dev Sources'!$C13>0,'HDPL Dev Sources'!$C13,\"\")","v":""},"Source Name","Source Name"]
[null,null,"Column1","Column2","Column3","Column89","Column15","Column18","Column19","Column22","Column23","Column24","Column25","Column26","Column33","Column34"]
[null,"LAND COST/ACQUISITION","Land Cost or Value",{"$f":"SUM(F6:N6)","v":0},{"$f":"SUM(O6:P6)","v":0}]
[null,null,"Demolition",{"$f":"SUM(F7:N7)","v":0},0]
[null,null,"Legal",0,0]
[null,null,"Onsite Predevelopment  (do not include construction of housing units)",0,0]
[null,null,"Off-Site Improvements",0,0]
[null,null,"Predevelopment Interest/Holding Cost",0,0]
[null,null,"Assumed, Accrued Interest on Existing Debt",0,0]
[null,null,null,{"$f":"SUBTOTAL(109,D6:D12)","v":0},0,0,0,0,0,0,0,0,0,0,0,0]
[null,"REHABILITATION","Site Work",{"$f":"SUM(F14:N14)","v":0},{"$f":"SUM(O14:P14)","v":0}]
[null,null,"Structures",0,0]
[null,null,"General Requirements",0,{"$f":"SUM(O16:P16)","v":0}]
[null,null,"Contractor Overhead",0,0]
[null,null,"Contractor Profit",0,0]
[null,null,"Prevailing Wages",0,0]
[null,null,"General Liability Insurance",0,0]
[null,null,"Other: (Specify)",0,0]
[null,null,"Other: (Specify)",0,0]
[null,null,"Other: (Specify)",0,0]
[null,null,"Other: (Specify)",0,0]
[null,null,"Total Relocation Expenses",0,{"$f":"SUM(O25:P25)","v":0}]
[null,null,null,{"$f":"SUBTOTAL(109,D14:D25)","v":0},{"$f":"SUBTOTAL(109,E14:E25)","v":0},0,0,0,0,0,0,0,0,0,0,0]
[null,"NEW CONSTRUCTION","Pre-Development Site Preparation",{"$f":"SUM(F27:N27)","v":0},{"$f":"SUM(O27:P27)","v":0}]
[null,null,"New Unit Home Construction (Labor and Materials)",0,{"$f":"SUM(O28:P28)","v":0}]
[null,null,"General Requirements",0,0]
[null,null,"Prevailing Wages",0,0]
[null,null,"General Liability Insurance",0,0]
[null,null,"Other: (Specify)",0,0]
[null,null,"Other: (Specify)",0,0]
[null,null,"Other: (Specify)",0,0]
[null,null,null,{"$f":"SUBTOTAL(109,D27:D34)","v":0},0,0,0,0,0,0,0,0,0,0,0,0]
[null,"ARCH. FEES","Design",{"$f":"SUM(F36:N36)","v":0},{"$f":"SUM(O36:P36)","v":0}]
[null,null,"Supervision",{"$f":"SUM(F37:N37)","v":0},{"$f":"SUM(O37:P37)","v":0}]
[null,null,"Total Survey & Engineering",{"$f":"SUM(F38:N38)","v":0},{"$f":"SUM(O38:P38)","v":0}]
[null,null,"Other: (Specify)",{"$f":"SUM(F39:N39)","v":0},{"$f":"SUM(O39:P39)","v":0}]
[null,null,"Other: (Specify)",{"$f":"SUM(F40:N40)","v":0},{"$f":"SUM(O40:P40)","v":0}]
[null,null,null,{"$f":"SUBTOTAL(109,D36:D40)","v":0},{"$f":"SUBTOTAL(109,E36:E40)","v":0},0,0,0,0,0,0,0,0,0,0,0]
[null,"CONSTRUCTION INTEREST & FEES","Construction Loan Interest",{"$f":"SUM(F42:N42)","v":0},{"$f":"SUM(O42:P42)","v":0}]
[null,null,"Change to Construction Loan Financing  Fees",0,0]
[null,null,"Bond Premium",0,0]
[null,null,"Title & Recording",0,0]
[null,null,"Taxes",0,0]
[null,null,"Insurance",0,0]
[null,null,null,{"$f":"SUBTOTAL(109,D42:D47)","v":0},0,0,0,0,0,0,0,0,0,0,0,0]
[null,"LEGAL FEES","Attorney fees directly associated with activities related to units funded by the CalHome Program",{"$f":"SUM(F49:N49)","v":0},{"$f":"SUM(O49:P49)","v":0}]
[null,null,"Other: (Specify)",{"$f":"SUM(F50:N50)","v":0},{"$f":"SUM(O50:P50)","v":0}]
[null,null,null,{"$f":"SUBTOTAL(109,D49:D50)","v":0},0,0,0,0,0,0,0,0,0,0,0,0]
[null,"RESERVES","Operating Reserve",{"$f":"SUM(F52:N52)","v":0},{"$f":"SUM(O52:P52)","v":0}]
[null,null,"Replacement Reserve",0,0]
[null,null,"Transition Reserve",0,0]
[null,null,"Other: (Specify)",0,0]
[null,null,"Other: (Specify)",0,0]
[null,null,"Other: (Specify)",0,0]
[null,null,null,{"$f":"SUBTOTAL(109,D52:D57)","v":0},0,0,0,0,0,0,0,0,0,0,0,0]
[null,"CONTINGENCY COSTS","Pre Construction Hard Cost Contingency ",{"$f":"SUM(F59:N59)","v":0},{"$f":"SUM(O59:P59)","v":0}]
[null,null,"Pre Construction Soft Cost Contingency",{"$f":"SUM(F60:N60)","v":0},{"$f":"SUM(O60:P60)","v":0}]
[null,null,"Construction Hard Cost Contingency ",{"$f":"SUM(F61:N61)","v":0},{"$f":"SUM(O61:P61)","v":0}]
[null,null,"Soft Construction Cost Contingency",{"$f":"SUM(F62:N62)","v":0},{"$f":"SUM(O62:P62)","v":0}]
[null,null,"Other: (Specify)",{"$f":"SUM(F63:N63)","v":0},{"$f":"SUM(O63:P63)","v":0}]
[null,null,null,{"$f":"SUBTOTAL(109,D59:D63)","v":0},{"$f":"SUBTOTAL(109,E59:E63)","v":0},0,0,0,0,0,0,0,0,0,0,0]
[null,"OTHER PROJECT COSTS","Environmental hazard reports, surveys, and investigations",{"$f":"SUM(F65:N65)","v":0},{"$f":"SUM(O65:P65)","v":0}]
[null,null,"Local Development Impact Fees",0,0]
[null,null,"Permit Processing Fees",0,0]
[null,null,"Marketing",0,0]
[null,null,"Market Study",0,0]
[null,null,"Appraisal Costs",0,0]
[null,null,"Construction Management",0,{"$f":"SUM(O71:P71)","v":0}]
[null,null,"Prevailing Wage Monitoring",0,0]
[null,null,null,{"$f":"SUBTOTAL(109,D65:D72)","v":0},0,0,0,0,0,0,0,0,0,0,0,0]
[null,"DEVELOPER COSTS","Developer Overhead/Profit",{"$f":"SUM(F74:N74)","v":0},{"$f":"SUM(O74:P74)","v":0}]
[null,null,"Consultant/Processing Agent",0,0]
[null,null,"Project Administration",0,0]
[null,null,"Broker Fees Paid to a Related Party",0,0]
[null,null,"Construction Oversight by Developer",0,{"$f":"SUM(O78:P78)","v":0}]
[null,null,"Other: (Specify)",0,0]
[]
[null,null,"General comments:"]
[]
[]
[null,"End of Document"]

{"sheet":"CalHome Threshold Requirements","index":10,"n_rows":182,"n_cols":49,"rows_kept":182,"cut":false,"hidden":true,"merged":[[68,5,68,36],[76,48,77,48],[100,48,103,48],[108,48,111,48],[118,48,123,48],[128,48,131,48],[136,48,140,48],[145,48,161,48],[162,48,166,48],[153,8,153,15],[146,37,146,38],[153,29,153,31],[147,37,147,38],[147,27,147,29],[158,8,158,15],[136,37,136,38],[137,20,137,22],[137,23,137,25],[137,26,137,28],[137,29,137,31],[137,37,137,38],[164,37,164,38],[162,37,162,38],[162,3,162,36],[168,48,170,48],[20,45,24,45],[25,45,26,45],[32,45,34,45],[37,45,39,45],[41,45,44,45],[45,45,47,45],[61,45,64,45],[76,45,77,45],[100,45,103,45],[108,45,111,45],[118,45,123,45],[128,45,131,45],[136,45,140,45],[145,45,161,45],[162,45,166,45],[168,45,170,45],[20,48,24,48],[25,48,26,48],[32,48,34,48],[37,48,39,48],[41,48,44,48],[45,48,47,48],[61,48,64,48],[32,42,34,42],[37,42,39,42],[118,42,123,42],[100,42,103,42],[108,42,111,42],[128,42,131,42],[136,42,140,42],[25,42,26,42],[41,42,44,42],[45,42,47,42],[61,42,64,42],[76,42,77,42],[168,2,168,36],[158,29,158,31],[160,29,160,31],[154,32,154,36],[161,16,161,28],[161,3,161,7],[159,3,159,7],[160,3,160,7],[157,3,157,7],[158,3,158,7],[160,8,160,15],[161,29,161,31],[155,29,155,31],[155,32,155,36],[161,8,161,15],[159,8,159,15],[159,29,159,31],[159,32,159,36],[157,8,157,15],[157,29,157,31],[157,32,157,36],[160,32,160,36],[159,16,159,28],[158,16,158,28],[169,2,169,36],[170,2,170,36],[163,3,163,36],[151,3,151,36],[152,16,152,28],[153,16,153,28],[154,16,154,28],[155,16,155,28],[156,16,156,28],[157,16,157,28],[153,32,153,36],[160,16,160,28],[155,3,155,7],[164,3,164,9],[164,10,164,17],[164,18,164,20],[161,32,161,36],[158,32,158,36],[152,29,152,31],[152,32,152,36],[153,3,153,7],[155,8,155,15],[165,3,165,36],[166,3,166,36],[164,21,164,23],[164,24,164,26],[164,27,164,29],[164,30,164,36],[148,3,148,36],[156,3,156,7],[156,8,156,15],[156,29,156,31],[156,32,156,36],[154,3,154,7],[154,8,154,15],[154,29,154,31],[163,37,163,38],[152,3,152,7],[152,8,152,15],[109,32,109,36],[109,20,109,22],[144,3,144,36],[137,32,137,36],[137,16,137,18],[138,3,138,8],[138,9,138,22],[139,3,139,36],[128,3,128,36],[119,3,119,6],[120,23,120,25],[131,3,131,36],[127,3,127,36],[133,3,133,36],[134,3,134,36],[135,3,135,36],[136,3,136,36],[119,18,119,19],[120,3,120,6],[110,3,110,36],[130,3,130,36],[145,37,145,38],[145,3,145,36],[140,3,140,36],[123,4,123,36],[142,3,142,36],[143,3,143,36],[137,3,137,6],[137,7,137,14],[103,3,103,36],[128,37,128,38],[129,20,129,22],[129,23,129,25],[129,26,129,28],[129,29,129,31],[129,37,129,38],[129,3,129,6],[129,7,129,13],[129,18,129,19],[129,32,129,36],[129,15,129,17],[114,3,114,36],[121,3,121,36],[118,3,118,36],[118,37,118,38],[101,15,101,17],[119,7,119,13],[168,37,168,38],[172,2,172,36],[172,37,172,38],[146,32,146,36],[146,3,146,8],[147,3,147,8],[147,32,147,36],[146,2,147,2],[101,3,101,6],[101,7,101,13],[101,18,101,19],[113,3,113,36],[101,20,101,22],[101,23,101,25],[101,26,101,28],[101,29,101,31],[101,37,101,38],[109,29,109,31],[109,37,109,38],[109,18,109,19],[101,32,101,36],[117,37,117,38],[119,23,119,25],[119,26,119,28],[119,29,119,31],[119,37,119,38],[120,20,120,22],[120,26,120,28],[120,29,120,31],[119,32,119,36],[120,32,120,36],[119,15,119,17],[174,37,174,38],[174,2,174,36],[94,4,94,36],[88,37,88,38],[94,37,94,38],[96,2,96,36],[97,3,97,36],[98,3,98,36],[99,3,99,36],[100,3,100,36],[89,4,89,36],[89,37,89,38],[88,4,88,36],[90,4,90,36],[90,37,90,38],[91,4,91,36],[91,37,91,38],[92,4,92,36],[92,37,92,38],[102,3,102,17],[109,7,109,13],[109,3,109,6],[119,20,119,22],[32,37,32,38],[109,15,109,17],[147,19,147,26],[2,37,2,38],[105,3,105,36],[106,3,106,36],[107,3,107,36],[108,3,108,36],[108,37,108,38],[109,23,109,25],[109,26,109,28],[76,5,76,36],[76,37,76,38],[77,1,77,3],[77,4,77,12],[77,13,77,30],[77,31,77,36],[77,37,77,38],[70,2,70,36],[71,2,71,36],[73,4,73,36],[74,5,74,36],[62,5,62,36],[50,13,50,30],[24,4,24,12],[24,13,24,30],[24,31,24,36],[25,5,25,36],[39,1,39,3],[32,5,32,36],[34,1,34,3],[34,4,34,12],[34,13,34,30],[34,31,34,36],[33,5,33,12],[33,21,33,36],[33,13,33,20],[31,5,31,36],[26,1,26,3],[26,4,26,12],[26,13,26,30],[36,1,36,3],[36,4,36,12],[36,13,36,30],[36,31,36,36],[147,9,147,17],[115,3,115,36],[116,3,116,36],[117,3,117,36],[3,37,3,38],[21,5,21,12],[21,13,21,36],[19,5,19,36],[20,5,20,36],[20,37,20,38],[13,37,13,38],[16,37,16,38],[4,1,4,38],[6,1,6,36],[9,2,9,36],[12,2,12,36],[10,2,10,36],[3,33,3,36],[11,2,11,36],[39,31,39,36],[24,37,24,38],[34,37,34,38],[26,37,26,38],[24,1,24,3],[120,7,120,13],[120,15,120,17],[146,27,146,29],[67,37,67,38],[146,19,146,26],[146,9,146,17],[79,4,79,36],[80,4,80,36],[81,4,81,36],[82,4,82,36],[84,2,84,36],[85,2,85,36],[86,4,86,36],[72,2,72,36],[87,37,87,38],[100,37,100,38],[87,4,87,36],[111,3,111,36],[120,37,120,38],[125,3,125,36],[126,3,126,36],[72,37,72,38],[78,4,78,36],[120,18,120,19],[17,5,17,36],[181,1,181,38],[25,37,25,38],[37,37,37,38],[61,37,61,38],[50,37,50,38],[149,4,149,36],[150,4,150,36],[50,4,50,12],[49,5,49,36],[52,5,52,36],[55,5,55,36],[57,5,57,36],[28,4,28,36],[29,5,29,36],[74,37,74,38],[75,5,75,36],[53,1,53,3],[122,4,122,36],[46,37,46,38],[44,37,44,38],[17,37,17,38],[26,31,26,36],[29,37,29,38],[40,5,40,36],[44,1,44,3],[44,4,44,12],[44,13,44,30],[44,31,44,36],[47,1,47,3],[47,4,47,12],[47,13,47,30],[47,31,47,36],[45,5,45,36],[42,5,42,6],[42,16,42,18],[43,5,43,6],[46,5,46,36],[60,5,60,36],[61,5,61,36],[55,37,55,38],[57,37,57,38],[59,4,59,36],[50,1,50,3],[67,5,67,36],[41,5,41,6],[41,16,41,18],[53,13,53,30],[53,31,53,36],[47,37,47,38],[53,4,53,12],[62,37,62,38],[66,4,66,36],[50,31,50,36],[178,1,178,8],[179,1,179,38],[7,1,7,38],[41,7,41,15],[42,7,42,15],[43,7,43,15],[41,19,41,29],[42,19,42,29],[43,19,43,29],[41,30,41,32],[42,30,42,32],[43,30,43,32],[41,33,41,36],[42,33,42,36],[43,33,43,36],[13,2,13,36],[16,5,16,36],[14,4,14,36],[15,5,15,36],[43,16,43,18],[53,37,53,38],[37,5,37,36],[35,5,35,36],[35,37,35,38],[176,2,176,36],[20,42,24,42],[3,41,4,41],[3,42,4,42],[3,44,4,44],[3,47,4,47],[3,45,4,45],[3,48,4,48],[145,42,161,42],[162,42,166,42],[168,42,170,42],[36,37,36,38],[45,37,45,38],[22,5,22,36],[23,5,23,36],[39,37,39,38],[38,5,38,17],[38,18,38,24],[38,25,38,38],[39,4,39,12],[39,13,39,30],[176,37,176,38],[63,5,63,36],[64,5,64,36]]}
[]
[]
[null,null,null,null,null,null,null,null,null,null,null,null,null,null,null,null,null,null,null,null,null,null,null,null,null,null,null,null,null,null,null,null,null,null,null,null,null,{"$f":"EDATE(Appduedate,-48)","v":"2021-02-13"},null,null,null,"Reviewer 1","Comments",null,"Reviewer 2","Comments",null,"Manager Review","Comments"]
[null,null,null,null,null,null,null,null,null,null,null,null,null,null,null,null,null,null,null,null,null,null,null,null,null,null,null,null,null,null,null,null,null,"App due date:",null,null,null,{"$f":"Appduedate","v":"2025-02-13"},null,null,null,"Thomson, Kara",{"$f":"IF(OR($AP$14=\"FAIL\",$AP$21=\"FAIL\",$AP$26=\"FAIL\",$AP$30=\"FAIL\",$AP$33=\"FAIL\",$AP$51=\"FAIL\",$AP$54=\"FAIL\",$AP$56=\"FAIL\",$AP$58=\"FAIL\",$AP$62=\"FAIL\",$AP$68=\"FAIL\",$AP$73=\"FAIL\",$AP$75=\"FAIL\",$AP$77=\"FAIL\",$AP$88=\"FAIL\",$AP$95=\"FAIL\",$AP$146=\"FAIL\",$AP$169=\"FAIL\",$AP$173=\"FAIL\",$AP$175=\"FAIL\",$AP$177=\"FAIL\"),\"FAIL\",\"PASS\")","v":"PASS"},null,"Bouldin, Brandon",{"$f":"IF(OR($AS$14=\"FAIL\",$AS$21=\"FAIL\",$AS$26=\"FAIL\",$AS$30=\"FAIL\",$AS$33=\"FAIL\",$AS$51=\"FAIL\",$AS$54=\"FAIL\",$AS$56=\"FAIL\",$AS$58=\"FAIL\",$AS$62=\"FAIL\",$AS$68=\"FAIL\",$AS$73=\"FAIL\",$AS$75=\"FAIL\",$AS$77=\"FAIL\",$AS$88=\"FAIL\",$AS$95=\"FAIL\",$AS$146=\"FAIL\",$AS$169=\"FAIL\",$AS$173=\"FAIL\",$AS$175=\"FAIL\",$AS$177=\"FAIL\"),\"FAIL\",\"PASS\")","v":"PASS"},null,"Melendres, Gail",{"$f":"IF(OR($AV$14=\"FAIL\",$AV$21=\"FAIL\",$AV$26=\"FAIL\",$AV$30=\"FAIL\",$AV$33=\"FAIL\",$AV$51=\"FAIL\",$AV$54=\"FAIL\",$AV$56=\"FAIL\",$AV$58=\"FAIL\",$AV$62=\"FAIL\",$AV$68=\"FAIL\",$AV$73=\"FAIL\",$AV$75=\"FAIL\",$AV$77=\"FAIL\",$AV$88=\"FAIL\",$AV$95=\"FAIL\",$AV$146=\"FAIL\",$AV$169=\"FAIL\",$AV$173=\"FAIL\",$AV$175=\"FAIL\",$AV$177=\"FAIL\"),\"FAIL\",\"PASS\")","v":"PASS"}]
[null,"CalHome Program - Threshold Requirements"]
[]
[null,"§208 CalHome Threshold Requirements"]
[null,"Applications will not be considered for funding unless the application is received by the deadline as stated in the NOFA and demonstrates compliance with all CalHome Program Statutes and Guidelines, including the following conditions:"]
[]
[null,"(a)","The Applicant meets geographic restrictions per CalHome Guidelines (Guidelines §200, subd. (a))."]
[null,"(b)","The Applicant is an eligible Local Public Entity, Local Public Agency, Tribal Entity, or Nonprofit Corporation (Guidelines §200). For purposes of these Guidelines, a Local Public Entity or Locality is defined to include a Tribal Entity. Pursuant to Health & Safety Code §50091, a Nonprofit Corporation shall include a Tribally Designated Housing Entity as further defined therein."]
[null,"(c)","The Applicant has complied with reporting requirements (Guidelines §200, subd. (c))."]
[null,null,"§200 Eligible Applicants "]
[null,null,"To be eligible to apply for funding, the Applicant shall be a Local Public Entity, Local Public Agency, Tribal Entity, or Nonprofit Corporation. Appendix B of these Guidelines contains more details on tribal eligibility.",null,null,null,null,null,null,null,null,null,null,null,null,null,null,null,null,null,null,null,null,null,null,null,null,null,null,null,null,null,null,null,null,null,null,{"$f":"IF(OR(vmApplicant1Type=\"Local Public Entity\",vmApplicant1Type=\"Local Public Agency\",vmApplicant1Type=\"Tribal Entity\",vmApplicant1Type=\"Nonprofit Corporation\"),TRUE,FALSE)","v":false}]
[null,null,null,"(a)","Geographic restrictions"]
[null,null,null,null,"(1)","A Local Public Entity that is not a Tribal Entity shall only be eligible to apply for an Award of CalHome Program funds for a Local Program or project located within its jurisdictional boundaries. A Tribal Entity shall be eligible to apply for an award of CalHome program funds for a Local Program or project located anywhere within the state of California, as long as the Tribal Entity has provided documentation establishing site control. "]
[null,null,null,null,null,{"$f":"CONCATENATE(\"The \",vmApplicant1,\" \",\"acknowledges/certifies eligibility to apply for an Award of CalHome Program funds for a Local Program or project located within its jurisdictional boundaries.\")","v":"The  acknowledges/certifies eligibility to apply for an Award of CalHome Program funds for a Local Program or project located within its jurisdictional boundaries."}]
[null,null,null,null,null,"Tribal Entity acknowledges to be eligible to apply for an award of CalHome program funds for a Local Program or project located anywhere within the state of California."]
[]
[null,null,null,null,"(2)","A Nonprofit Corporation or Tribally Designated Housing Entity shall only be eligible to apply for an Award of CalHome Program funds for a program or project if it has developed a project or operated a housing program in California within the past two years or if the Nonprofit Corporation or Tribally Designated Housing Entity has an existing 523 Self-Help Technical Assistance Grant Agreement with the United States Department of Agriculture (USDA)."]
[null,null,null,null,null,"Has the Nonprofit Corporation or Tribally Designated Housing Entity developed a project or operated a housing program in California within the past two years, preceding application due date?"]
[null,null,null,null,null,"Project or housing program name:"]
[null,null,null,null,null,"Describe the Project or housing program, include dates of operation."]
[]
[null,"File Name:",null,null,{"$f":"'Document Checklist-Full List'!$B$62","v":"32. CalH Project or Housing Program"},null,null,null,null,null,null,null,null,{"$f":"'Document Checklist-Full List'!$K$62","v":"Provide documentation for the Nonprofit Corporation or Tribally Designated Housing Entity that has developed a project or operated a housing program in California within the past two years preceding application due date."},null,null,null,null,null,null,null,null,null,null,null,null,null,null,null,null,null,"Uploaded to HCD?"]
[null,null,null,null,null,"Does the Nonprofit Corporation or Tribally Designated Housing Entity has an existing 523 Self-Help Technical Assistance Grant Agreement with the United States Department of Agriculture (USDA)?"]
[null,"File Name:",null,null,{"$f":"'Document Checklist-Full List'!$B$63","v":"33. CalH USDA Agreement"},null,null,null,null,null,null,null,null,{"$f":"'Document Checklist-Full List'!$K$63","v":"Provide a copy of the existing Grant Agreement with the USDA."},null,null,null,null,null,null,null,null,null,null,null,null,null,null,null,null,null,"Uploaded to HCD?"]
[]
[null,null,null,"(b)","Stability and capacity"]
[null,null,null,null,"(1)","To be eligible for funding, the Applicant certifies to demonstrate to the Department’s satisfaction that it has sufficient organizational stability and capacity to carry out the activity for which it is requesting funds."]
[]
[null,null,null,null,"(2)","In order to demonstrate organizational stability, the Applicant shall have been operating as a housing Developer or housing program administrator for a minimum of two years prior to the date of application. In cases of Tribal Entities, the Department may consider any experience a Tribal Entity has with the Indian Home Loan Guarantee program under Section 184 of the Housing and Community Development Act of 1992. An Applicant may subcontract with an Administrative Subcontractor to qualify toward the organizational stability and experience requirement. The Administrative Subcontractor may be located anywhere within the state of California. A legally binding agreement between the Applicant and the Administrative Subcontractor must be submitted with the application. Multiple Applicants may establish a consortium (provided there is a legally binding agreement between the parties) with a single Administrative Subcontractor. One Applicant shall apply on behalf of other entities in a consortium. In the event that an Administrative Subcontractor cannot fulfill, or fails to fulfill, its obligations under the applicable legally binding agreement for the full term thereof, a CalHome Recipient must secure a new Administrative Subcontractor and provide HCD a new legally binding agreement within 90 days of when the previous legally binding agreement terminated. The new Administrative Subcontractor is obliged to fulfill the same experience requirements as the previous Administrative Subcontractor. The Recipient is required to submit this new legally binding agreement and experience documentation to HCD for approval. If an Applicant does not have a legally binding agreement in place and approved by HCD, within 90 days of losing their Administrative Subcontractor, their CalHome awarded funds will be disencumbered. "]
[null,null,null,null,null,"Has the Applicant been operating as a housing Developer or housing program administrator for a minimum of two years preceding the Application due date?"]
[null,null,null,null,null,"Applicant has been operating as a:",null,null,null,null,null,null,null,null,null,null,null,null,null,null,null," for at least two years preceding the Application due date."]
[null,"File Name:",null,null,{"$f":"'Document Checklist-Full List'!$B$64","v":""},null,null,null,null,null,null,null,null,{"$f":"'Document Checklist-Full List'!$K$64","v":"Provide documentation that the Applicant has been operating as a housing Developer or housing program administrator for a minimum of two years preceding the Application due date."},null,null,null,null,null,null,null,null,null,null,null,null,null,null,null,null,null,"Uploaded to HCD?"]
[null,null,null,null,null,"Does the Tribal Entity have any experience with §184 Indian Home Loan Guarantee program?"]
[null,"File Name:",null,null,{"$f":"'Document Checklist-Full List'!$B$66","v":"36. CalH 184 IHLGP"},null,null,null,null,null,null,null,null,{"$f":"'Document Checklist-Full List'!$K$66","v":"Provide documentation that the Applicant/Tribal Entity have experience with §184 Indian Home Loan Guarantee program."},null,null,null,null,null,null,null,null,null,null,null,null,null,null,null,null,null,"Uploaded to HCD?"]
[null,null,null,null,null,"Will the Applicant/Locality subcontract with an Administrative Subcontractor to qualify toward the organizational stability and experience requirement?"]
[null,null,null,null,null,"Administrative subcontractor has been operating as a:",null,null,null,null,null,null,null,null,null,null,null,null,null,null,null,null,null,null,null," for at least two years preceding the Application due date."]
[null,"File Name:",null,null,{"$f":"'Document Checklist-Full List'!$B$65","v":"35. CalH AS binding agreement"},null,null,null,null,null,null,null,null,{"$f":"'Document Checklist-Full List'!$K$65","v":"Provide an executed binding agreement between the Applicant and Administrative Subcontractor."},null,null,null,null,null,null,null,null,null,null,null,null,null,null,null,null,null,"Uploaded to HCD?"]
[null,null,null,null,null,"Provide the name(s) of the Administrative Subcontractors"]
[null,null,null,null,"AS1","Name:",null,null,null,null,null,null,null,null,null,null,"Address:",null,null,null,null,null,null,null,null,null,null,null,null,null,"Entity type:"]
[null,null,null,null,"AS2","Name:",null,null,null,null,null,null,null,null,null,null,"Address:",null,null,null,null,null,null,null,null,null,null,null,null,null,"Entity type:"]
[null,null,null,null,"AS3","Name:",null,null,null,null,null,null,null,null,null,null,"Address:",null,null,null,null,null,null,null,null,null,null,null,null,null,"Entity type:"]
[null,"File Name:",null,null,{"$f":"'Document Checklist-Full List'!$B$58","v":"28. CalH AS1 Certificate of GS\n28. CalH AS2 Certificate of GS\n28. CalH AS3 Certificate of GS"},null,null,null,null,null,null,null,null,{"$f":"'Document Checklist-Full List'!$K$58","v":"Provide a Certificate of Good Standing for each Admistrative Subcontractor; must be dated 30 days or less from the application due date."},null,null,null,null,null,null,null,null,null,null,null,null,null,null,null,null,null,"Uploaded to HCD?"]
[null,null,null,null,null,{"$f":"CONCATENATE(\"Is the \",vmApplicant1,\" \",\"in a consortium of localities (provided there is a legally binding agreement between the parties) with a single administrator?\")","v":"Is the  in a consortium of localities (provided there is a legally binding agreement between the parties) with a single administrator?"}]
[null,null,null,null,null,{"$f":"CONCATENATE(\"Is the \",vmApplicant1,\" \",\"applying on behalf of other localities in a consortium and may serve all localities?\")","v":"Is the  applying on behalf of other localities in a consortium and may serve all localities?"}]
[null,"File Name:",null,null,{"$f":"'Document Checklist-Full List'!$B$59","v":"29. CalH Consortium Agreement"},null,null,null,null,null,null,null,null,{"$f":"'Document Checklist-Full List'!$K$59","v":"Provide the legally binding agreement between the parties."},null,null,null,null,null,null,null,null,null,null,null,null,null,null,null,null,null,"Uploaded to HCD?"]
[]
[null,null,null,null,"(3)","A Nonprofit Corporation must be a corporation whose exempt purposes for the two years prior to the date of application have included the activity for which it is applying."]
[null,"File Name:",null,null,{"$f":"'Document Checklist-Full List'!$B$67","v":"37. CalH Nonprofit Activity - 2 years"},null,null,null,null,null,null,null,null,{"$f":"'Document Checklist-Full List'!$K$67","v":"Provide documentation that the Applicant, for the two years preceding the application date, have included the activity for which it is applying."},null,null,null,null,null,null,null,null,null,null,null,null,null,null,null,null,null,"Uploaded to HCD?"]
[]
[null,null,null,null,"(4)","A Nonprofit Corporation shall also demonstrate financial stability to the Department’s satisfaction through audited financial statements submitted for Department review as part of its application for funding."]
[null,"File Name:",null,null,{"$f":"'Document Checklist-Full List'!$B$68","v":"38. CalH Audited Financial Statements"},null,null,null,null,null,null,null,null,{"$f":"'Document Checklist-Full List'!$K$68","v":"Provide a copy of audited financial statements (most recent 2 years)"},null,null,null,null,null,null,null,null,null,null,null,null,null,null,null,null,null,"Uploaded to HCD?"]
[]
[null,null,null,null,"(5)","The Applicant certifies to meet the additional stability and capacity requirements set forth in these Guidelines for the specific activity for which it is applying."]
[]
[null,null,null,null,"(6)","Applicant acknowledges and understand that to the extent necessary to address a presidential declaration of disaster or emergency, or a “state of emergency” or a “local emergency” declared by the Governor under Government Code (“GC”) §8571, the Department may alter or waive state-required criteria set forth in this subsection (b), to the extent otherwise allowed by law. "]
[]
[null,null,null,"(c)","Reporting requirements"]
[null,null,null,null,"(1)","Recipients shall submit outstanding reports from previous CalHome Program loans and/or grants to the Department by the application date (as specified in the NOFA). Failure to submit the reports by the application date will make the Recipients ineligible for a CalHome Program Award."]
[null,null,null,null,null,"Does the Applicant/Recipient have previous loans and/or grants from the CalHome Program?"]
[null,null,null,null,null,"Applicant/Recipient certifies to have submitted all outstanding reports from previous CalHome Program loans and/or grants to the Department by the application date?"]
[null,null,null,null,null,"Provide a list of all loans and/or grants, award date(s), loan and/or grant numbers, and describe the activities therein."]
[]
[]
[null,null,null,"(d)","Community-Based Developers"]
[null,null,null,null,"(1)","Applicant acknowledges that solely for the purpose of applying to the Community-Based Developer funding target, a Community-Based Developer shall qualify on its own as an eligible Applicant so long as the Community-Based Developer meets the experience requirements set forth in Appendix A."]
[null,null,null,null,null,"Note: these experience requirements are being requested to \"Project Overview\" sheet."]
[]
[null,"(d)","The activity is eligible (Guidelines §201)."]
[null,null,"§201 Eligible Activities "]
[null,null,"Applicant acknowledges its intent to apply to the CalHome Program and the following activities:"]
[null,null,null,"(a)","Homeownership Development Project Loans"]
[null,null,null,null,"§400.5(a)","Applicant acknowledges that the Department may make Predevelopment Loans to eligible Applicants for development of Homeownership Development Projects, including Program eligible Housing Developments that include ADUs or JADUs, or make permanent Loans for Mutual Housing and limited equity housing cooperatives."]
[null,null,null,null,"§400.5(b)","Proposed development projects shall be ineligible to receive funding if Predevelopment Work has begun or will begin prior to the application due date. “Predevelopment Work” includes grading; site preparation (with the exception of demolition or clearing of property); or site improvements intended for public dedication."]
[null,null,null,null,null,"Has the Applicant completed or will complete any construction work at the development site preceding application date?"]
[null,"File Name:",null,null,{"$f":"'Document Checklist-Full List'!$B$69","v":"39. CalH Construction Work Exception"},null,null,null,null,null,null,null,null,{"$f":"'Document Checklist-Full List'!$K$69","v":"Provide an explanation how the Project meets the exceptions specified in program Guidelines §201(a)(2)."},null,null,null,null,null,null,null,null,null,null,null,null,null,null,null,null,null,"Uploaded to HCD?"]
[null,null,null,"(b)","Self Help Technical Assistance Grants."]
[null,null,null,"(c)","Mortgage Assistance Grants."]
[null,null,null,"(d)","Owner-Occupied Rehabilitation Grants."]
[null,null,null,"(e)","Shared Housing Grants."]
[null,null,null,"(f)","Accessory Dwelling Units/Junior Accessory Dwelling Units Grants."]
[]
[null,"(e)","The proposed use of funds is eligible (Guidelines §202)."]
[null,null,"§202 Eligible and Ineligible Uses of Funds."]
[null,null,null,"(a)","Eligible uses of funds for specific activities are set forth in the Guideline provisions that directly address each activity."]
[null,null,null,null,"The Applicant acknowledges that the CalHome Program funds in support of a Homeownership Development Project shall be used only for the following costs: §400.2 (a-j)."]
[null,null,null,null,"The Applicant acknowledges that the CalHome Program funds in support of a Self-Help Technical Assistance project shall be used only for the following costs of direct services. Indirect costs are not permitted: §401.2 (a-d)."]
[null,null,null,null,"The Applicant acknowledges that the CalHome Program funds in support of a Mortgage Assistance program shall be used only for the following costs: §402.2 (a-d)."]
[null,null,null,null,"The Applicant acknowledges that the CalHome Program funds in support of an Owner-Occupied Rehabilitation program shall be used only for the following costs: §403.2 (a-h)."]
[null,null,null,null,"The Applicant acknowledges that the CalHome Program Shared Housing Technical Assistance funds shall be used only for the following costs: §404.2 (a-b)."]
[null,null,null,null,"The Applicant acknowledges that the CalHome Program funds in support of an ADU/JADU Program shall be used only for the following costs: §405.2 (a-f)."]
[]
[null,null,null,"(b)","Applicant acknowledges that CalHome Program funds shall not be used for any of the following costs that may be incurred in the Local Program or the project: §202 (b)(1-7)."]
[]
[null,"(f)","The Applicant meets the eligibility requirements for the activity or activities for which they are applying:"]
[null,null,"(1)","First-Time Homebuyer Mortgage Assistance (Guidelines §402.1)"]
[null,null,null,"§402.1 Eligible Applicant  "]
[null,null,null,"In addition to the requirements of §200, to be eligible to apply for CalHome Program funding for a Mortgage Assistance program, the Applicant or its Administrative Subcontractor shall have successfully administered a homebuyer program for a minimum of two years within the four years immediately preceding the application."]
[null,null,null,"Applicant or its Administrative Subcontractor certifies to have successfully administered a homebuyer program for a minimum of two years within the four years immediately preceding the application?"]
[null,null,null,"Program name:",null,null,null,null,null,null,null,null,null,null,null,"Asstd. Units",null,null,null,null,"Start date:",null,null,null,null,null,"End date:",null,null,null,null,null,"Meet requirement?",null,null,null,null,{"$f":"IF(OR($X$102=\"\",YEARFRAC($X$102,Appduedate)<2),FALSE,IF(YEARFRAC(Edate,IF($AD$102=\"\",Appduedate,$AD$102),1)<2,FALSE,TRUE))","v":false}]
[null,null,null,"Describe in detail the administered homebuyer program: "]
[]
[]
[null,null,"(2)","Owner-Occupied Rehabilitation Assistance (Guidelines §403.1)."]
[null,null,null,"§403.1 Eligible Applicant  "]
[null,null,null,"In addition to the requirements of §200, to be eligible to apply for CalHome Program assistance for an Owner-Occupied Rehabilitation Program, the Applicant or its Administrative Subcontractor shall have successfully administered a local Owner-Occupied Rehabilitation Program for a minimum of two years within the four years immediately preceding the application."]
[null,null,null,"Applicant or its Administrative Subcontractor certifies to have successfully administered a local Owner-Occupied Rehabilitation Program for a minimum of two years within the four years immediately preceding the application?"]
[null,null,null,"Program name:",null,null,null,null,null,null,null,null,null,null,null,"Asstd. Units",null,null,null,null,"Start date:",null,null,null,null,null,"End date:",null,null,null,null,null,"Meet requirement?",null,null,null,null,{"$f":"IF(OR($X$110=\"\",YEARFRAC($X$110,Appduedate)<2),FALSE,IF(YEARFRAC(Edate,IF($AD$110=\"\",Appduedate,$AD$110),1)<2,FALSE,TRUE))","v":false}]
[null,null,null,"Describe in detail the administered local Owner-Occupied Rehabilitation Program: "]
[]
[]
[null,null,"(3)","Technical Assistance for Self-Help Housing Projects (Guidelines §401.1)."]
[null,null,null,"§401.1 Eligible Applicant  "]
[null,null,null,"In addition to meeting the requirements of §200 of these Guidelines, to be eligible to apply for CalHome Program assistance for a Self-Help Technical Assistance project, the Applicant shall meet the criteria set forth in the California Code of Regulations (CCR), Title 25, Division 1, Chapter 7, Subchapter 6.5, Article 1, §7532 “Eligible Sponsors”, and have successfully completed a minimum of two Self-Help Construction projects within the four years immediately preceding the application."]
[null,null,null,"§7532 “Eligible Sponsors” means local public entities or nonprofit corporations including cooperatives that are engaged in, or will be engaged in developing, conducting, administering or coordinating programs of assistance which will aid eligible households construct or rehabilitate residential units for their own use."]
[null,null,null,"Does the Applicant meet the definition for \"Eligible Sponsors\" as stated above?"]
[null,null,null,"Applicant/Sponsor certifies to have successfully completed a minimum of two Self-Help Construction projects within the four years immediately preceding the application?"]
[null,null,null,"Project name:",null,null,null,null,null,null,null,null,null,null,null,"Asstd. Units",null,null,null,null,"Start date:",null,null,null,null,null,"End date:",null,null,null,null,null,"Meet requirement?",null,null,null,null,{"$f":"IF(OR($AD$120<Edate,$AD$120=\"\"),FALSE,TRUE)","v":false}]
[null,null,null,"Project name:",null,null,null,null,null,null,null,null,null,null,null,"Asstd. Units",null,null,null,null,"Start date:",null,null,null,null,null,"End date:",null,null,null,null,null,"Meet requirement?",null,null,null,null,{"$f":"IF(OR($AD$121<Edate,$AD$121=\"\"),FALSE,TRUE)","v":false}]
[null,null,null,"Describe in detail the completed two Self-Help Construction projects:"]
[null,null,null,"SH project #1"]
[null,null,null,"SH project #2"]
[]
[null,null,"(4)","Technical Assistance for Shared Housing Programs (Guidelines §404.1)."]
[null,null,null,"§404.1 Eligible Applicant  "]
[null,null,null,"In addition to the requirements of §200, to be eligible to apply for CalHome Program assistance for a Shared Housing program, the Applicant or its Administrative Subcontractor shall have successfully administered a Shared Housing program for renters or homeowners for a minimum of two years immediately preceding the application."]
[null,null,null,"Applicant or its Administrative Subcontractor certifies to have successfully administered a Shared Housing program for renters or homeowners for a minimum of two years immediately preceding the application?"]
[null,null,null,"Program name:",null,null,null,null,null,null,null,null,null,null,null,"Asstd. Units",null,null,null,null,"Start date:",null,null,null,null,null,"End date:",null,null,null,null,null,"Meet requirement?",null,null,null,null,{"$f":"IF(OR($X$130=\"\",YEARFRAC($X$130,Appduedate)<2),FALSE,IF(YEARFRAC(Edate,IF($AD$130=\"\",Appduedate,$AD$130),1)<2,FALSE,TRUE))","v":false}]
[null,null,null,"Describe in detail the administered Shared Housing program for renters or homeowners:"]
[]
[]
[null,null,"(5)","ADU/JADU Assistance (Guidelines §405.1)."]
[null,null,null,"§405.1 Eligible Applicant  "]
[null,null,null,"In addition to the requirements of §200, to be eligible to apply for CalHome Program assistance for an ADU/JADU Program, the Applicant or its Administrative Subcontractor shall have successfully administered a local Owner-Occupied Rehabilitation Program, new construction development involving multiple Homeownership units (including single-family subdivisions), or an ADU/JADU Program for a minimum of two years within the four years immediately preceding the application."]
[null,null,null,"Applicant or its Administrative Subcontractor certifies to have successfully administered a local Owner-Occupied Rehabilitation Program, new construction development involving multiple Homeownership units (including single-family subdivisions), or an ADU/JADU Program for a minimum of two years within the four years immediately preceding the application?"]
[null,null,null,"Program Type:",null,null,null,null,null,null,null,null,null,null,null,null,"Asstd. Units",null,null,null,"Start date:",null,null,null,null,null,"End date:",null,null,null,null,null,"Meet requirement?",null,null,null,null,{"$f":"IF(OR(X138=\"\",YEARFRAC(X138,Appduedate)<2),FALSE,IF(YEARFRAC(Edate,IF(AD138=\"\",Appduedate,AD138),1)<2,FALSE,TRUE))","v":false}]
[null,null,null,"Program/project name:"]
[null,null,null,"Describe in detail the administered local program/project:"]
[]
[]
[null,null,"(6)","Homeownership Development Project Loans (Guidelines §400.1)."]
[null,null,null,"§400.1 Eligible Applicant  "]
[null,null,null,"In addition to the requirements of §200, to be eligible to apply for a Homeownership Development Project Loan, an Applicant shall have successfully completed development of a minimum of two similar projects within the last four years, and the Applicant shall have staff that will be committed to the proposed project that possess the knowledge, skills, and ability to perform the tasks required in a Homeownership Development Project. If the Applicant will use a portion of a Homeownership Development Project Loan to provide Mortgage Assistance to qualified First-Time Homebuyers, the Applicant or its Administrative Subcontractor shall also have successfully administered a homebuyer program for a minimum of two years within the four years immediately preceding the application."]
[null,null,null,"The Applicant certifies to have successfully completed development of a minimum of two similar projects within the last four years, and the Applicant shall have staff that will be committed to the proposed project that possess the knowledge, skills, and ability to perform the tasks required in a Homeownership Development Project?"]
[null,null,null,"Similar project name #1:",null,null,null,null,null,null,null,null,null,null,null,null,null,null,null,"Completed Development Date:",null,null,null,null,null,null,null,null,null,null,null,null,"Meet requirement?",null,null,null,null,{"$f":"IF(AB147=\"\",FALSE,IF(OR($AB$147<Edate,$AB$147=\"\"),FALSE,TRUE))","v":false}]
[null,null,null,"Similar project name #2:",null,null,null,null,null,null,null,null,null,null,null,null,null,null,null,"Completed Development Date:",null,null,null,null,null,null,null,null,null,null,null,null,"Meet requirement?",null,null,null,null,{"$f":"IF($AB$148=\"\",FALSE,IF(OR($AB$148<Edate,$AB$148=\"\"),FALSE,TRUE))","v":false}]
[null,null,null,"Describe in detail the completed two similar projects:"]
[null,null,null,"Similar project #1"]
[null,null,null,"Similar project #2"]
[null,null,null,"Project Staffing Chart for Applicant/Sponsor"]
[null,null,null,"Staff Type",null,null,null,null,"Employee / Consultant full name",null,null,null,null,null,null,null,"Position Title and Employer",null,null,null,null,null,null,null,null,null,null,null,null,"Full time / Part time",null,null,"% of time dedicated to this Project"]
[]
[]
[]
[]
[]
[]
[]
[]
[]
[null,null,null,"Will the Applicant use a portion of a Homeownership Development Project Loan to provide Mortgage Assistance to qualified First-Time Homebuyers?"]
[null,null,null,"Applicant or its Administrative Subcontractor certifies to have successfully administered a homebuyer program for a minimum of two years within the four years immediately preceding the application?"]
[null,null,null,"Homebuyer program name:",null,null,null,null,null,null,null,null,null,null,null,null,null,null,"Start date:",null,null,null,null,null,"End date:",null,null,null,null,null,"Applicant meet requirement?",null,null,null,null,null,null,{"$f":"IF(OR($V$165=\"\",YEARFRAC($V$165,Appduedate)<2),FALSE,IF(YEARFRAC(Edate,IF($AB$165=\"\",Appduedate,$AB$165),1)<2,FALSE,TRUE))","v":false}]
[null,null,null,"Describe in detail the administered homebuyer program:"]
[]
[]
[null,"(g)","Applicant certifies that the application is complete (Guidelines §501 (a-f))?"]
[null,null,"§501 (f) - Below, provide a description of how the Applicant will comply with the requirements of Local Program/Project administration set forth in §204 of these Guidelines applicable to the Program or Project being applied for."]
[]
[]
[null,"(h)","Applicant certifies that the application is complete with Department forms and cannot be altered or modified by the Applicant?"]
[]
[null,"(i)","Applicant certifies that it does not have any unresolved audit findings for prior Department or federally funded housing or community development projects or programs (Guidelines §501(c))?"]
[]
[null,"(j)","Applicant certifies that it has no pending lawsuits that would impede the implementation of the program (Guidelines §501(c))?"]
[]
[null,"Applicant Notes/Comments"]
[]
[]
[null,"End of Document"]

{"sheet":"FWHG Threshold Requiremets","index":11,"n_rows":201,"n_cols":49,"rows_kept":201,"cut":false,"hidden":true,"merged":[[127,48,143,48],[144,48,148,48],[153,48,157,48],[161,48,170,48],[178,48,180,48],[193,48,195,48],[32,48,34,48],[37,48,39,48],[41,48,44,48],[45,48,47,48],[61,48,64,48],[77,48,78,48],[99,48,102,48],[107,48,110,48],[117,48,122,48],[193,42,195,42],[20,45,24,45],[25,45,26,45],[32,45,34,45],[37,45,39,45],[41,45,44,45],[45,45,47,45],[61,45,64,45],[77,45,78,45],[99,45,102,45],[107,45,110,45],[117,45,122,45],[127,45,143,45],[144,45,148,45],[153,45,157,45],[161,45,170,45],[178,45,180,45],[193,45,195,45],[99,42,102,42],[107,42,110,42],[117,42,122,42],[127,42,143,42],[144,42,148,42],[153,42,157,42],[161,42,170,42],[178,42,180,42],[32,42,34,42],[37,42,39,42],[41,42,44,42],[45,42,47,42],[61,42,64,42],[68,5,68,36],[77,42,78,42],[179,2,179,36],[180,2,180,36],[175,1,175,3],[175,4,175,12],[175,13,175,30],[175,31,175,36],[175,37,175,38],[167,1,167,38],[168,1,168,38],[169,1,169,11],[169,12,169,36],[169,37,169,38],[170,1,170,19],[170,20,170,33],[170,34,170,38],[3,41,4,41],[3,42,4,42],[3,44,4,44],[3,45,4,45],[3,47,4,47],[3,48,4,48],[20,42,24,42],[25,42,26,42],[20,48,24,48],[25,48,26,48],[182,2,182,36],[183,1,183,3],[183,4,183,12],[183,13,183,30],[183,31,183,36],[183,37,183,38],[66,4,66,36],[67,5,67,36],[67,37,67,38],[75,6,75,36],[76,6,76,36],[77,6,77,36],[176,1,176,3],[176,4,176,12],[176,13,176,30],[176,31,176,36],[176,37,176,38],[172,1,172,38],[173,1,173,38],[174,1,174,3],[174,4,174,12],[174,13,174,30],[174,31,174,36],[174,37,174,38],[171,1,171,19],[171,20,171,33],[171,34,171,38],[165,1,165,15],[165,16,165,26],[165,27,165,32],[165,33,165,35],[165,36,165,38],[166,1,166,15],[166,16,166,26],[166,27,166,32],[166,33,166,35],[166,36,166,38],[163,22,163,28],[163,29,163,33],[163,34,163,36],[163,37,163,38],[164,1,164,15],[164,16,164,18],[164,19,164,21],[164,22,164,28],[164,29,164,33],[164,34,164,38],[128,2,129,2],[129,3,129,9],[129,10,129,17],[129,18,129,20],[129,21,129,23],[129,24,129,26],[129,27,129,29],[129,30,129,36],[129,37,129,38],[200,1,200,38],[191,2,191,36],[191,37,191,38],[193,2,193,36],[193,37,193,38],[194,3,194,36],[195,1,195,3],[195,4,195,12],[195,13,195,30],[195,31,195,36],[195,37,195,38],[197,1,197,8],[198,1,198,38],[155,3,155,36],[156,3,156,36],[178,2,178,36],[178,37,178,38],[185,2,185,36],[185,37,185,38],[187,2,187,36],[187,37,187,38],[189,2,189,36],[189,37,189,38],[158,1,158,38],[159,1,159,36],[160,1,160,36],[161,1,161,36],[161,37,161,38],[162,1,162,15],[162,16,162,18],[162,19,162,21],[162,22,162,28],[162,29,162,33],[162,34,162,38],[163,1,163,15],[163,16,163,18],[163,19,163,21],[148,3,148,36],[150,3,150,36],[151,3,151,36],[152,3,152,36],[153,3,153,36],[153,37,153,38],[154,20,154,22],[154,23,154,25],[154,26,154,28],[154,29,154,31],[154,37,154,38],[154,3,154,6],[154,14,154,17],[154,18,154,19],[154,7,154,13],[154,32,154,36],[146,3,146,9],[146,10,146,17],[146,18,146,20],[146,21,146,23],[146,24,146,26],[146,27,146,29],[146,30,146,36],[146,37,146,38],[147,3,147,36],[143,3,143,7],[143,8,143,15],[143,16,143,28],[143,29,143,31],[143,32,143,36],[144,3,144,36],[144,37,144,38],[145,3,145,36],[145,37,145,38],[141,3,141,7],[141,8,141,15],[141,16,141,28],[141,29,141,31],[141,32,141,36],[142,3,142,7],[142,8,142,15],[142,16,142,28],[142,29,142,31],[142,32,142,36],[139,3,139,7],[139,8,139,15],[139,16,139,28],[139,29,139,31],[139,32,139,36],[140,3,140,7],[140,8,140,15],[140,16,140,28],[140,29,140,31],[140,32,140,36],[137,3,137,7],[137,8,137,15],[137,16,137,28],[137,29,137,31],[137,32,137,36],[138,3,138,7],[138,8,138,15],[138,16,138,28],[138,29,138,31],[138,32,138,36],[135,3,135,7],[135,8,135,15],[135,16,135,28],[135,29,135,31],[135,32,135,36],[136,3,136,7],[136,8,136,15],[136,16,136,28],[136,29,136,31],[136,32,136,36],[130,3,130,36],[131,4,131,36],[132,4,132,36],[133,3,133,36],[134,3,134,7],[134,8,134,15],[134,16,134,28],[134,29,134,31],[134,32,134,36],[127,37,127,38],[128,3,128,9],[128,10,128,17],[128,18,128,20],[128,21,128,23],[128,24,128,26],[128,27,128,29],[128,30,128,36],[128,37,128,38],[120,3,120,36],[121,4,121,36],[122,4,122,36],[124,3,124,36],[125,3,125,36],[126,3,126,36],[127,3,127,36],[118,20,118,22],[118,23,118,25],[118,26,118,28],[118,29,118,31],[118,3,118,6],[118,7,118,13],[118,14,118,17],[118,18,118,19],[119,3,119,6],[119,7,119,13],[119,14,119,17],[119,18,119,19],[118,32,118,36],[119,32,119,36],[118,37,118,38],[119,20,119,22],[119,23,119,25],[119,26,119,28],[119,29,119,31],[119,37,119,38],[110,3,110,36],[112,3,112,36],[113,3,113,36],[114,3,114,36],[115,3,115,36],[116,3,116,36],[116,37,116,38],[117,3,117,36],[117,37,117,38],[108,20,108,22],[108,23,108,25],[108,26,108,28],[108,29,108,31],[108,37,108,38],[109,3,109,36],[108,3,108,6],[108,7,108,13],[108,18,108,19],[108,32,108,36],[108,15,108,17],[106,3,106,36],[107,3,107,36],[107,37,107,38],[29,37,29,38],[31,5,31,36],[32,5,32,36],[32,37,32,38],[39,1,39,3],[39,4,39,12],[39,13,39,30],[39,31,39,36],[39,37,39,38],[34,37,34,38],[37,5,37,36],[37,37,37,38],[38,5,38,17],[38,18,38,24],[57,5,57,36],[57,37,57,38],[59,4,59,36],[50,37,50,38],[52,5,52,36],[70,2,70,36],[71,2,71,36],[26,37,26,38],[104,3,104,36],[105,3,105,36],[38,25,38,38],[53,1,53,3],[53,4,53,12],[53,13,53,30],[53,31,53,36],[53,37,53,38],[49,5,49,36],[50,1,50,3],[50,4,50,12],[50,13,50,30],[50,31,50,36],[61,37,61,38],[62,37,62,38],[55,5,55,36],[55,37,55,38],[60,4,60,36],[61,4,61,36],[62,4,62,36],[63,4,63,36],[64,4,64,36],[86,4,86,36],[44,37,44,38],[47,1,47,3],[47,4,47,12],[47,13,47,30],[47,31,47,36],[47,37,47,38],[19,5,19,36],[20,5,20,36],[20,37,20,38],[45,5,45,36],[45,37,45,38],[46,5,46,36],[46,37,46,38],[35,5,35,36],[35,37,35,38],[36,1,36,3],[36,4,36,12],[36,13,36,30],[36,31,36,36],[41,16,41,18],[41,19,41,29],[41,30,41,32],[41,33,41,36],[42,33,42,36],[3,33,3,36],[3,37,3,38],[4,1,4,38],[6,1,6,36],[7,1,7,38],[9,2,9,36],[16,5,16,36],[16,37,16,38],[13,37,13,38],[15,5,15,36],[10,2,10,36],[11,2,11,36],[12,2,12,36],[13,2,13,36],[14,4,14,36],[17,5,17,36],[17,37,17,38],[36,37,36,38],[34,1,34,3],[34,4,34,12],[34,13,34,30],[34,31,34,36],[28,4,28,36],[29,5,29,36],[21,5,21,12],[21,13,21,36],[22,5,22,36],[23,5,23,36],[24,1,24,3],[24,4,24,12],[24,13,24,30],[24,31,24,36],[24,37,24,38],[25,5,25,36],[25,37,25,38],[26,1,26,3],[26,4,26,12],[26,13,26,30],[26,31,26,36],[44,1,44,3],[44,4,44,12],[40,5,40,36],[41,5,41,6],[41,7,41,15],[33,5,33,12],[33,13,33,20],[33,21,33,36],[44,13,44,30],[44,31,44,36],[43,5,43,6],[43,7,43,15],[43,16,43,18],[43,19,43,29],[43,30,43,32],[43,33,43,36],[42,5,42,6],[42,7,42,15],[42,16,42,18],[42,19,42,29],[42,30,42,32],[82,4,82,36],[72,37,72,38],[84,2,84,36],[85,2,85,36],[74,5,74,36],[79,4,79,36],[80,4,80,36],[81,4,81,36],[78,1,78,3],[78,4,78,12],[78,13,78,30],[78,31,78,36],[78,37,78,38],[75,37,75,38],[77,37,77,38],[72,2,72,36],[73,4,73,36],[101,3,101,36],[102,3,102,36],[100,20,100,22],[100,23,100,25],[100,26,100,28],[100,32,100,36],[100,3,100,6],[100,7,100,13],[100,18,100,19],[100,15,100,17],[100,29,100,31],[89,4,89,36],[89,37,89,38],[90,4,90,36],[90,37,90,38],[91,4,91,36],[91,37,91,38],[87,37,87,38],[100,37,100,38],[96,3,96,36],[97,3,97,36],[98,3,98,36],[99,3,99,36],[99,37,99,38],[93,4,93,36],[93,37,93,38],[95,2,95,36],[88,4,88,36],[88,37,88,38],[87,4,87,36]]}
[]
[]
[null,null,null,null,null,null,null,null,null,null,null,null,null,null,null,null,null,null,null,null,null,null,null,null,null,null,null,null,null,null,null,null,null,null,null,null,null,null,null,null,null,"Reviewer 1","Comments",null,"Reviewer 2","Comments",null,"Manager Review","Comments"]
[null,null,null,null,null,null,null,null,null,null,null,null,null,null,null,null,null,null,null,null,null,null,null,null,null,null,null,null,null,null,null,null,null,"App due date:",null,null,null,{"$f":"Appduedate","v":"2025-02-13"},null,null,null,"Melendres, Gail",{"$f":"IF(OR(AP14=\"FAIL\",AP17=\"FAIL\",AP18=\"FAIL\",AP21=\"FAIL\",AP26=\"FAIL\",AP30=\"FAIL\",AP33=\"FAIL\",AP36=\"FAIL\",AP38=\"FAIL\",AP42=\"FAIL\",AP46=\"FAIL\",AP51=\"FAIL\",AP54=\"FAIL\",AP56=\"FAIL\",AP58=\"FAIL\",AP62=\"FAIL\",AP68=\"FAIL\",AP73=\"FAIL\",AP76=\"FAIL\",AP78=\"FAIL\",AP88=\"FAIL\",AP89=\"FAIL\",AP90=\"FAIL\",AP91=\"FAIL\",AP92=\"FAIL\",AP94=\"FAIL\",AP100=\"FAIL\",AP108=\"FAIL\",AP117=\"FAIL\",AP118=\"FAIL\",AP128=\"FAIL\",AP145=\"FAIL\",AP154=\"FAIL\",AP162=\"FAIL\",AP179=\"FAIL\",AP184=\"FAIL\",AP186=\"FAIL\",AP188=\"FAIL\",AP190=\"FAIL\",AP192=\"FAIL\",AP194=\"FAIL\"),\"FAIL\",\"PASS\")","v":"PASS"},null,"Melendres, Gail",{"$f":"IF(OR(AS14=\"FAIL\",AS17=\"FAIL\",AS18=\"FAIL\",AS21=\"FAIL\",AS26=\"FAIL\",AS30=\"FAIL\",AS33=\"FAIL\",AS36=\"FAIL\",AS38=\"FAIL\",AS42=\"FAIL\",AS46=\"FAIL\",AS51=\"FAIL\",AS54=\"FAIL\",AS56=\"FAIL\",AS58=\"FAIL\",AS62=\"FAIL\",AS68=\"FAIL\",AS73=\"FAIL\",AS76=\"FAIL\",AS78=\"FAIL\",AS88=\"FAIL\",AS89=\"FAIL\",AS90=\"FAIL\",AS91=\"FAIL\",AS92=\"FAIL\",AS94=\"FAIL\",AS100=\"FAIL\",AS108=\"FAIL\",AS117=\"FAIL\",AS118=\"FAIL\",AS128=\"FAIL\",AS145=\"FAIL\",AS154=\"FAIL\",AS162=\"FAIL\",AS179=\"FAIL\",AS184=\"FAIL\",AS186=\"FAIL\",AS188=\"FAIL\",AS190=\"FAIL\",AS192=\"FAIL\",AS194=\"FAIL\"),\"FAIL\",\"PASS\")","v":"PASS"},null,"Penner, Kendra",{"$f":"IF(OR(AV14=\"FAIL\",AV17=\"FAIL\",AV18=\"FAIL\",AV21=\"FAIL\",AV26=\"FAIL\",AV30=\"FAIL\",AV33=\"FAIL\",AV36=\"FAIL\",AV38=\"FAIL\",AV42=\"FAIL\",AV46=\"FAIL\",AV51=\"FAIL\",AV54=\"FAIL\",AV56=\"FAIL\",AV58=\"FAIL\",AV62=\"FAIL\",AV68=\"FAIL\",AV73=\"FAIL\",AV76=\"FAIL\",AV78=\"FAIL\",AV88=\"FAIL\",AV89=\"FAIL\",AV90=\"FAIL\",AV91=\"FAIL\",AV92=\"FAIL\",AV94=\"FAIL\",AV100=\"FAIL\",AV108=\"FAIL\",AV117=\"FAIL\",AV118=\"FAIL\",AV128=\"FAIL\",AV145=\"FAIL\",AV154=\"FAIL\",AV162=\"FAIL\",AV179=\"FAIL\",AV184=\"FAIL\",AV186=\"FAIL\",AV188=\"FAIL\",AV190=\"FAIL\",AV192=\"FAIL\",AV194=\"FAIL\"),\"FAIL\",\"PASS\")","v":"PASS"}]
[null,"Joe Serna, Jr. Farmworker Housing Grant (Serna)  - Threshold Requirements"]
[]
[null,"§208 FWHG Threshold Requirements"]
[null,"Projects shall be eligible for an Award of funds when the application demonstrates that all of the following threshold requirements have been met:"]
[]
[null,"(a)","The Applicant meets geographic restrictions pursuant to §200 of these Guidelines."]
[null,"(b)","The Applicant is an eligible Local Public Entity, Local Public Agency, Tribal Entity, or Nonprofit Corporation pursuant to §200 of these Guidelines. For purposes of these Guidelines, a Local Public Entity or Locality is defined to include a Tribal Entity. Pursuant to Health & Safety Code §50091, a Nonprofit Corporation shall include a Tribally Designated Housing Entity as further defined therein."]
[null,"(c)","The Applicant has complied with reporting requirements pursuant to §200 subd. (c) of these Guidelines."]
[null,null,"§200 Eligible Applicants "]
[null,null,"To be eligible to apply for funding, the Applicant shall be a Local Public Entity, Local Public Agency, Tribal Entity, Nonprofit Corporation, Limited Liability Company, or Limited Partnership. Appendix B of these Guidelines contains more details on tribal eligibility. In the case of a Nonprofit Corporation, Limited Liability Company, or Limited Partnership, they shall demonstrate to the Department’s satisfaction that the Applicant is independent from any direction of, or control by, a for-profit entity and shall meet the requirements of §200.1 and 200.2 of these Guidelines.",null,null,null,null,null,null,null,null,null,null,null,null,null,null,null,null,null,null,null,null,null,null,null,null,null,null,null,null,null,null,null,null,null,null,{"$f":"IF(OR(vmApplicant1Type=\"Local Public Entity\",vmApplicant1Type=\"Tribal Entity\",vmApplicant1Type=\"Nonprofit Corporation\",vmApplicant1Type=\"Limited Liability Company\",vmApplicant1Type=\"Limited Partnership\"),TRUE,FALSE)","v":false},null,null,null,"PASS",null,null,"PASS",null,null,"PASS"]
[null,null,null,"(a)","Geographic restrictions"]
[null,null,null,null,"(1)","A Local Public Entity that is not a Tribal Entity shall only be eligible to apply for an Award of Program Funds for a Local Program or project located within its jurisdictional boundaries. A Tribal Entity shall be eligible to apply for an award of program funds for a Local Program or project located anywhere within the state of California, as long as the Tribal Entity has provided documentation establishing site control."]
[null,null,null,null,null,{"$f":"CONCATENATE(\"The \",vmApplicant1,\" \",\" acknowledges/certifies eligibility to apply for an Award of CalHome Program funds for a Local Program or project located within its jurisdictional boundaries.\")","v":"The   acknowledges/certifies eligibility to apply for an Award of CalHome Program funds for a Local Program or project located within its jurisdictional boundaries."},null,null,null,null,null,null,null,null,null,null,null,null,null,null,null,null,null,null,null,null,null,null,null,null,null,null,null,null,null,null,null,null,null,null,null,"PASS",null,null,"PASS",null,null,"PASS"]
[null,null,null,null,null,"Tribal Entity acknowledges to be eligible to apply for an award of CalHome program funds for a Local Program or project located anywhere within the state of California."]
[]
[null,null,null,null,"(2)","A Nonprofit Corporation or Tribally Designated Housing Entity shall only be eligible to apply for an Award of Program funds for a Program or Project if it has developed a Project or operated a housing program in California within the past two years or if the Nonprofit Corporation or Tribally Designated Housing Entity has an existing 523 Self-Help Technical Assistance Grant Agreement with the United States Department of Agriculture (USDA)."]
[null,null,null,null,null,"Has the Nonprofit Corporation or Tribally Designated Housing Entity developed a project or operated a housing program in California within the past two years, preceding application due date?"]
[null,null,null,null,null,"Project or housing program name:"]
[null,null,null,null,null,"Describe the Project or housing program, include dates of operation."]
[]
[null,"File Name:",null,null,{"$f":"'Document Checklist-Full List'!$B$74","v":"42. FWHG Project or Housing Program"},null,null,null,null,null,null,null,null,{"$f":"'Document Checklist-Full List'!$K$74","v":"Provide documentation for the Nonprofit Corporation that has developed a project or operated a housing program in California within the past two years preceding application due date."},null,null,null,null,null,null,null,null,null,null,null,null,null,null,null,null,null,"Uploaded to HCD?"]
[null,null,null,null,null,"Does the Nonprofit Corporation has an existing 523 Self-Help Technical Assistance Grant Agreement with the United States Department of Agriculture (USDA)?"]
[null,"File Name:",null,null,{"$f":"'Document Checklist-Full List'!$B$75","v":"43. FWHG USDA Agreement"},null,null,null,null,null,null,null,null,{"$f":"'Document Checklist-Full List'!$K$75","v":"Provide a copy of the existing Grant Agreement with the USDA."},null,null,null,null,null,null,null,null,null,null,null,null,null,null,null,null,null,"Uploaded to HCD?"]
[]
[null,null,null,"(b)","Stability and capacity"]
[null,null,null,null,"(1)","To be eligible for funding, the Applicant certifies to demonstrate to the Department’s satisfaction that it has sufficient organizational stability and capacity to carry out the activity for which it is requesting funds."]
[]
[null,null,null,null,"(2)","In order to demonstrate organizational stability, the Applicant shall have been operating as a housing Developer or housing program administrator for a minimum of two years prior to the date of application. In cases of Tribal Entities, HCD may consider any experience a Tribal Entity has with the Indian Home Loan Guarantee program under Section 184 of the Housing and Community Development Act of 1992. An Applicant may subcontract with an Administrative Subcontractor to qualify toward organizational stability and experience requirement. The Administrative Subcontractor may be located anywhere within the state of California. A legally binding agreement between the Applicant and the Administrative Subcontractor must be submitted with the Applicant’s application. Multiple Applicants may establish a consortium (provided there is a legally binding agreement between the parties) with a single Administrative Subcontractor. One Applicant shall apply on behalf of other entities in a consortium. In the event an Administrative Subcontractor cannot, or fails to, fulfill its obligations under the applicable legally binding agreement for the full term thereof, a HOSN Recipient must secure a new Administrative Subcontractor and provide HCD a new legally binding agreement within 90 days of when the previous legally binding agreement terminated. The new Administrative Subcontractor is obliged to fulfill the same experience requirements as the previous Administrative Subcontractor. The Recipient is required to submit this new legally binding agreement and experience documentation to HCD for approval. If an Applicant does not have a legally binding agreement in place and approved by HCD within 90 days of losing their Administrative Subcontractor, their HOSN awarded funds will be disencumbered"]
[null,null,null,null,null,"Has the Applicant been operating as a housing Developer or housing program administrator for a minimum of two years preceding the Application due date?"]
[null,null,null,null,null,"Applicant has been operating as a:",null,null,null,null,null,null,null,null,null,null,null,null,null,null,null," for at least two years preceding the Application due date."]
[null,"File Name:",null,null,{"$f":"'Document Checklist-Full List'!$B$76","v":""},null,null,null,null,null,null,null,null,{"$f":"'Document Checklist-Full List'!$K$76","v":"Provide documentation that the Applicant been operating as a housing Developer or housing program administrator for a minimum of two years preceding the Application due date."},null,null,null,null,null,null,null,null,null,null,null,null,null,null,null,null,null,"Uploaded to HCD?"]
[null,null,null,null,null,"Does the Tribal Entity have any experience with §184 Indian Home Loan Guarantee program?"]
[null,"File Name:",null,null,{"$f":"'Document Checklist-Full List'!$B$66","v":"36. CalH 184 IHLGP"},null,null,null,null,null,null,null,null,{"$f":"'Document Checklist-Full List'!$K$66","v":"Provide documentation that the Applicant/Tribal Entity have experience with §184 Indian Home Loan Guarantee program."},null,null,null,null,null,null,null,null,null,null,null,null,null,null,null,null,null,"Uploaded to HCD?"]
[null,null,null,null,null,"Will the Applicant/Locality subcontract with an Administrative Subcontractor to qualify toward the organizational stability and experience requirement?"]
[null,null,null,null,null,"Administrative subcontractor has been operating as a:",null,null,null,null,null,null,null,null,null,null,null,null,null,null,null,null,null,null,null," for at least two years preceding the Application due date."]
[null,"File Name:",null,null,{"$f":"'Document Checklist-Full List'!$B$77","v":"45. FWHG AS binding agreement"},null,null,null,null,null,null,null,null,{"$f":"'Document Checklist-Full List'!$K$77","v":"Provide an executed binding agreement between the Applicant and Administrative Subcontractor."},null,null,null,null,null,null,null,null,null,null,null,null,null,null,null,null,null,"Uploaded to HCD?"]
[null,null,null,null,null,"If known, provide the name(s) of the Administrative Subcontractors"]
[null,null,null,null,"AS1","Name:",null,null,null,null,null,null,null,null,null,null,"Address:",null,null,null,null,null,null,null,null,null,null,null,null,null,"Entity type:"]
[null,null,null,null,"AS2","Name:",null,null,null,null,null,null,null,null,null,null,"Address:",null,null,null,null,null,null,null,null,null,null,null,null,null,"Entity type:"]
[null,null,null,null,"AS3","Name:",null,null,null,null,null,null,null,null,null,null,"Address:",null,null,null,null,null,null,null,null,null,null,null,null,null,"Entity type:"]
[null,"File Name:",null,null,{"$f":"'Document Checklist-Full List'!$B$72","v":"40. FWHG AS1 Certificate of GS\n40. FWHG AS2 Certificate of GS\n40. FWHG AS3 Certificate of GS"},null,null,null,null,null,null,null,null,{"$f":"'Document Checklist-Full List'!$K$72","v":"Provide a Certificate of Good Standing for each Admistrative Subcontractor; must be dated 30 days or less from the application due date."},null,null,null,null,null,null,null,null,null,null,null,null,null,null,null,null,null,"Uploaded to HCD?"]
[null,null,null,null,null,{"$f":"CONCATENATE(\"Is the \",vmApplicant1,\" \",\"in a consortium of localities (provided there is a legally binding agreement between the parties) with a single administrator?\")","v":"Is the  in a consortium of localities (provided there is a legally binding agreement between the parties) with a single administrator?"}]
[null,null,null,null,null,{"$f":"CONCATENATE(\"Is the \",vmApplicant1,\" \",\"applying on behalf of other entities in a consortium and may serve all localities?\")","v":"Is the  applying on behalf of other entities in a consortium and may serve all localities?"}]
[null,"File Name:",null,null,{"$f":"'Document Checklist-Full List'!$B$73","v":"41. FWHG Consortium Agreement"},null,null,null,null,null,null,null,null,{"$f":"'Document Checklist-Full List'!$K$73","v":"Provide the legally binding agreement between the parties."},null,null,null,null,null,null,null,null,null,null,null,null,null,null,null,null,null,"Uploaded to HCD?"]
[]
[null,null,null,null,"(3)","A Nonprofit Corporation must be a corporation whose exempt purposes for the two years prior to the date of application have included the activity for which it is applying."]
[null,"File Name:",null,null,{"$f":"'Document Checklist-Full List'!$B$78","v":"46. FWHG Nonprofit Activity - 2 years"},null,null,null,null,null,null,null,null,{"$f":"'Document Checklist-Full List'!$K$78","v":"Provide documentation that the Applicant, for the two years preceding the application date, have included the activity for which it is applying."},null,null,null,null,null,null,null,null,null,null,null,null,null,null,null,null,null,"Uploaded to HCD?"]
[]
[null,null,null,null,"(4)","A Nonprofit Corporation shall also demonstrate financial stability to the Department’s satisfaction through audited financial statements submitted for Department review as part of its application for funding."]
[null,"File Name:",null,null,{"$f":"'Document Checklist-Full List'!$B$79","v":"47. FWHG Audited Financial Statements"},null,null,null,null,null,null,null,null,{"$f":"'Document Checklist-Full List'!$K$79","v":"Provide a copy of audited financial statements (most recent 2 years)"},null,null,null,null,null,null,null,null,null,null,null,null,null,null,null,null,null,"Uploaded to HCD?"]
[]
[null,null,null,null,"(5)","The Applicant certifies to meet the additional stability and capacity requirements set forth in these Guidelines for the specific activity for which it is applying."]
[]
[null,null,null,null,"(6)","Applicant acknowledges and understand that to the extent necessary to address a presidential declaration of disaster or emergency, or a “state of emergency” or a “local emergency” declared by the Governor under Government Code (“GC”) §8571, the Department may alter or waive state-required criteria set forth in this subsection (b), to the extent otherwise allowed by law. "]
[]
[null,null,null,"(c)","Reporting requirements"]
[null,null,null,null,"Recipients shall submit outstanding reports from previous Program Awards to the Department by the application date (as specified in the Notice of Funding Availability (NOFA)). Failure to submit the reports by the application date will make the Recipients ineligible for a Program Award."]
[null,null,null,null,"Does the Applicant/Recipient have a previous loan(s) and/or grant(s) from the FWHG Program?"]
[null,null,null,null,"Applicant/Recipient certifies to have submitted all outstanding reports from previous FWHG Program loan(s) and/or grant(s) to the Department by the application date?"]
[null,null,null,null,"Provide a list of all loans and/or grants, award date(s), loan and/or grant numbers, and describe the activities therein."]
[]
[]
[null,null,null,"(d)","Community-Based Developers"]
[null,null,null,null,"(1)","Applicant acknowledges that solely for the purpose of applying to the Community-Based Developer funding target, a Community-Based Developer shall qualify on its own as an eligible Applicant so long as the Community-Based Developer meets the experience requirements set forth in Appendix A."]
[null,null,null,null,null,"Note: these experience requirements are being requested to \"Project Overview\" sheet."]
[]
[null,"(d)","The Activity is eligible pursuant to §201 of these Guidelines."]
[null,null,"§201 Eligible Activities "]
[null,null,"Pursuant to H.S.C. §50517.5 Applicant acknowledges its intent to apply to the FWHG Program and the following activities:?"]
[null,null,null,"(a)","Homeownership Development Project Loans."]
[null,null,null,null,"(1)","Single or Multifamily Housing new construction Projects in which ultimately Agricultural Households hold title to the Assisted Units."]
[null,null,null,null,null,"§400.5(a)","Applicant acknowledges that the Department may make Predevelopment Loans to eligible Applicants for development of Homeownership Development Projects, including Program eligible housing developments that include Accessory Dwelling Units (ADUs) or Junior Accessory Dwelling Units (JADUs), or make permanent Loans for Mutual Housing and limited equity housing cooperatives;"]
[null,null,null,null,null,"§400.5(b)","Proposed development Projects shall be ineligible to receive funding if Predevelopment Work has begun or will begin prior to the application due date. “Predevelopment Work” includes grading; site preparation (with the exception of demolition or clearing of property); or site improvements intended for public dedication."]
[null,null,null,null,null,null,"Has the Applicant completed or will complete any construction work at the development site preceding application date?"]
[null,"File Name:",null,null,{"$f":"'Document Checklist-Full List'!$B$80","v":"48. FWHG Construction Work Exception"},null,null,null,null,null,null,null,null,{"$f":"'Document Checklist-Full List'!$K$80","v":"Provide an explanation how the Project meets the exceptions specified in program Guidelines §201(a)(2)."},null,null,null,null,null,null,null,null,null,null,null,null,null,null,null,null,null,"Uploaded to HCD?"]
[null,null,null,"(b)","Self Help Technical Assistance Grants."]
[null,null,null,"(c)","Mortgage Assistance Grants."]
[null,null,null,"(d)","Owner-Occupied Rehabilitation Grants."]
[null,null,null,"(e)","Acquisition of Manufactured Housing Grants."]
[]
[null,"(e)","The proposed use of funds is eligible pursuant to §202 of these Guidelines."]
[null,null,"§202 Eligible and Ineligible Uses of Funds."]
[null,null,null,"(a)","Eligible uses of funds for specific activities are set forth in the guideline provisions that directly address each Activity."]
[null,null,null,null,"The Applicant acknowledges that the Serna funds in support of a Homeownership Development Project shall be used only for the following costs §400.2 (a-j)."]
[null,null,null,null,"The Applicant acknowledges that the Program funds in support of a Self-Help Technical Assistance Project shall be used only for the following costs: §401.2 (a-d)."]
[null,null,null,null,"The Applicant acknowledges that the Serna funds in support of a Mortgage Assistance Program shall be used only for the following costs: §402.2\n(a-d)."]
[null,null,null,null,"The Applicant acknowledges that the Program funds in support of an Owner-Occupied Rehabilitation Program shall be used only for the following costs: §403.2 (a-h)."]
[null,null,null,null,"The Applicant acknowledges that the Program funds in support of an Acquisition of Manufactured Housing program shall be used only for the following costs: §404.2 (a-h).",null,null,null,null,null,null,null,null,null,null,null,null,null,null,null,null,null,null,null,null,null,null,null,null,null,null,null,null,null,null,null,null,null,null,null,null,"PASS",null,null,"PASS",null,null,"PASS"]
[]
[null,null,null,"(b)","Applicant acknowledges that FWHG Program funds shall not be used for any of the following costs that may be incurred in the Program or Project: §202 (b)(1-7)."]
[]
[null,"(f)","The Applicant meets the eligibility requirements for the Activity or activities for which they are applying:"]
[null,null,"(1)","First-Time Homebuyer Mortgage Assistance pursuant to §402 of these Guidelines."]
[null,null,null,"§402.1 Eligible Applicant  "]
[null,null,null,"In addition to meeting the requirements of §200 of these Guidelines, an Applicant or its Administrative Subcontractor shall have successfully administered a homebuyer Program for a minimum of two years within the four years immediately preceding the application."]
[null,null,null,"Applicant or its Administrative Subcontractor certifies to have successfully administered a homebuyer program for a minimum of two years within the four years immediately preceding the application?"]
[null,null,null,"Program name:",null,null,null,null,null,null,null,null,null,null,null,"Asstd. Units",null,null,null,null,"Start date:",null,null,null,null,null,"End date:",null,null,null,null,null,"Meet requirement?",null,null,null,null,{"$f":"IF(OR($X$101=\"\",YEARFRAC($X$101,Appduedate)<2),FALSE,IF(YEARFRAC(Edate,IF($AD$101=\"\",Appduedate,$AD$101),1)<2,FALSE,TRUE))","v":false}]
[null,null,null,"Describe in detail the administered homebuyer program: "]
[]
[]
[null,null,"(2)","Owner-Occupied Rehabilitation Assistance pursuant to §403 of these Guidelines."]
[null,null,null,"§403.1 Eligible Applicant  "]
[null,null,null,"In addition to meeting the requirements of §200 of these Guidelines, an Applicant or its Administrative Subcontractor shall have successfully administered a local Owner-Occupied Rehabilitation Program for a minimum of two years within the four years immediately preceding the application."]
[null,null,null,"Applicant or its Administrative Subcontractor certifies to have successfully administered local Owner-Occupied Rehabilitation Program for a minimum of two years within the four years immediately preceding the application?"]
[null,null,null,"Program name:",null,null,null,null,null,null,null,null,null,null,null,"Asstd. Units",null,null,null,null,"Start date:",null,null,null,null,null,"End date:",null,null,null,null,null,"Meet requirement?",null,null,null,null,{"$f":"IF(OR($X$109=\"\",YEARFRAC($X$109,Appduedate)<2),FALSE,IF(YEARFRAC(Edate,IF($AD$109=\"\",Appduedate,$AD$109),1)<2,FALSE,TRUE))","v":false}]
[null,null,null,"Describe in detail the administered local Owner-Occupied Rehabilitation Program: "]
[]
[]
[null,null,"(3)","Technical Assistance for Self-Help Housing Projects pursuant to §401 of these Guidelines."]
[null,null,null,"§401.1 Eligible Applicant  "]
[null,null,null,"In addition to meeting the requirements of §200 of these Guidelines, the Applicant shall meet the criteria set forth in the California Code of Regulations (CCR), Title 25, Division 1, Chapter 7, Subchapter 6.5, Article 1, §7532 “Eligible Sponsors”, and have successfully completed a minimum of two Self-Help Construction Projects within the four years immediately preceding the application."]
[null,null,null,"§7532 “Eligible Sponsors” means local public entities or nonprofit corporations including cooperatives that are engaged in, or will be engaged in developing, conducting, administering or coordinating programs of assistance which will aid eligible households construct or rehabilitate residential units for their own use."]
[null,null,null,"Does the Applicant meet the definition for \"Eligible Sponsors\" as stated above?"]
[null,null,null,"Applicant/Sponsor certifies to have successfully completed a minimum of two Self-Help Construction projects within the four years immediately preceding the application?"]
[null,null,null,"Project name:",null,null,null,null,null,null,null,null,null,null,"Assisted Units",null,null,null,null,null,"Start date:",null,null,null,null,null,"End date:",null,null,null,null,null,"Meet requirement?",null,null,null,null,{"$f":"IF(OR($AD$119<Edate,$AD$119=\"\"),FALSE,TRUE)","v":false}]
[null,null,null,"Project name:",null,null,null,null,null,null,null,null,null,null,"Assisted Units",null,null,null,null,null,"Start date:",null,null,null,null,null,"End date:",null,null,null,null,null,"Meet requirement?",null,null,null,null,{"$f":"IF(OR($AD$120<Edate,$AD$120=\"\"),FALSE,TRUE)","v":false}]
[null,null,null,"Describe in detail the completed two Self-Help Construction projects:"]
[null,null,null,"SH project #1"]
[null,null,null,"SH project #2"]
[]
[null,null,"(4)","Homeownership Development Project Loans pursuant to §400 of these Guidelines."]
[null,null,null,"§400.1 Eligible Applicant  "]
[null,null,null,"In addition to meeting the requirements of §200 of these Guidelines, an Applicant shall have successfully completed development of a minimum of two similar Projects within the last four years, and the Applicant shall have staff that will be committed to the proposed Project that possess the knowledge, skills, and ability to perform the tasks required in a Homeownership Development Project. If the Applicant will use a portion of a Homeownership Development Project Loan to provide Mortgage Assistance to qualified First-Time Homebuyers, the Applicant or its Administrative Subcontractor shall also have successfully administered a homebuyer Program for a minimum of two years within the four years immediately preceding the application."]
[null,null,null,"The Applicant certifies to have successfully developed a minimum of two similar Projects within the last four years, and the Applicant shall have staff that will be committed to the proposed Project that possess the knowledge, skills, and ability to perform the tasks required in a Homeownership Development Project?"]
[null,null,null,"Similar project name #1:",null,null,null,null,null,null,null,null,null,null,null,null,null,null,"Start date:",null,null,null,null,null,"End date:",null,null,null,null,null,"Applicant meet requirement?",null,null,null,null,null,null,{"$f":"IF(OR($AB$129<Edate,$AB$129=\"\"),FALSE,TRUE)","v":false}]
[null,null,null,"Similar project name #2:",null,null,null,null,null,null,null,null,null,null,null,null,null,null,"Start date:",null,null,null,null,null,"End date:",null,null,null,null,null,"Applicant meet requirement?",null,null,null,null,null,null,{"$f":"IF(OR($AB$130<Edate,$AB$130=\"\"),FALSE,TRUE)","v":false}]
[null,null,null,"Describe in detail the completed two similar projects:"]
[null,null,null,"Similar project #1"]
[null,null,null,"Similar project #2"]
[null,null,null,"Project Staffing Chart for Applicant/Sponsor"]
[null,null,null,"Staff Type",null,null,null,null,"Employee / Consultant full name",null,null,null,null,null,null,null,"Position Title and Employer",null,null,null,null,null,null,null,null,null,null,null,null,"Full time / Part time",null,null,"% of time dedicated to this Project"]
[]
[]
[]
[]
[]
[]
[]
[]
[]
[null,null,null,"Will the Applicant use a portion of a Homeownership Development Project Loan to provide Mortgage Assistance to qualified First-Time Homebuyers?"]
[null,null,null,"Applicant or its Administrative Subcontractor certifies to have successfully administered a homebuyer program for a minimum of two years within the four years immediately preceding the application?"]
[null,null,null,"Homebuyer program name:",null,null,null,null,null,null,null,null,null,null,null,null,null,null,"Start date:",null,null,null,null,null,"End date:",null,null,null,null,null,"Applicant meet requirement?",null,null,null,null,null,null,{"$f":"IF(OR($V$147=\"\",YEARFRAC($V$147,Appduedate)<2),FALSE,IF(YEARFRAC(Edate,IF($AB$147=\"\",Appduedate,$AB$147),1)<2,FALSE,TRUE))","v":false}]
[null,null,null,"Describe in detail the administered homebuyer program:"]
[]
[]
[null,null,"(5)","Acquisition of a Manufactured Housing Grant Program pursuant to §404 of these Guidelines."]
[null,null,null,"§404.1 Eligible Applicant  "]
[null,null,null,"In addition to meeting the requirements of §200 of these Guidelines, to be eligible to apply for Serna funding for an Acquisition of Manufactured Housing Program, the Applicant or its Administrative Subcontractor shall have successfully administered a housing Program that serves Agricultural Workers for a minimum of two years within the four years immediately preceding the application. "]
[null,null,null,"Applicant or its Administrative Subcontractor certifies to have successfully administered a housing Program that serves Agricultural Workers for a minimum of two years within the four years immediately preceding the application?"]
[null,null,null,"Program name:",null,null,null,null,null,null,null,null,null,null,"Assisted Units",null,null,null,null,null,"Start date:",null,null,null,null,null,"End date:",null,null,null,null,null,"Meet requirement?",null,null,null,null,{"$f":"IF($X$155<Edate,FALSE,IF(YEARFRAC($X$155,IF($AD$155=\"\",Appduedate,$AD$155))<2,FALSE,TRUE))","v":false}]
[null,null,null,"Describe in detail the administered homebuyer program:"]
[]
[]
[null,"ARTICLE IV. PROGRAM REQUIREMENTS"]
[null,"§400.3 Site Control"]
[null,"\"Acquisition of Manufactured Housing Grants\"\nApplicants who can demonstrate that they have site control over land zoned appropriately on which to place all of the acquired Manufactured Homes for which they are applying for funding will receive the full 15 points. (for scoring purposes only)"]
[null,"At time of application, does Sponsor/Applicant, or its wholly controlled affiliate have site control pursuant to §400.3?",null,null,null,null,null,null,null,null,null,null,null,null,null,null,null,null,null,null,null,null,null,null,null,null,null,null,null,null,null,null,null,null,null,null,null,null,null,null,null,"N/A",null,null,"N/A",null,null,"N/A"]
[null,"Type of site control:",null,null,null,null,null,null,null,null,null,null,null,null,null,null,"Date",null,null,"Expires",null,null,"Extensions Available",null,null,null,null,null,null,"Purchase Price",null,null,null,null,"Total Land Area"]
[null,null,null,null,null,null,null,null,null,null,null,null,null,null,null,null,null,null,null,null,null,null,null,null,null,null,null,null,null,null,null,null,null,null,null,null,null,"acres"]
[]
[null,"Current owner",null,null,null,null,null,null,null,null,null,null,null,null,null,null,"Current owner street address",null,null,null,null,null,null,null,null,null,null,"City",null,null,null,null,null,"State",null,null,"Zip code"]
[]
[null,"Below, provide details for unusual site control special circumstances, and for applications with multiple or non-contiguous parcels, scattered sites, lot line adjustments, air rights parceling, phased projects, or other complex land transactions, including unique value calculations and explanations as applicable:"]
[]
[null,"Planned and completed property transfer(s). ",null,null,null,null,null,null,null,null,null,null,"Ground Lease planned?"]
[null,"Lessor",null,null,null,null,null,null,null,null,null,null,null,null,null,null,null,null,null,null,"Term",null,null,null,null,null,null,null,null,null,null,null,null,null,"Annual Payment"]
[]
[null,"Below, describe property transfers occurring in connection with development of the Project."]
[]
[null,"File Name:",null,null,{"$f":"'Document Checklist-Full List'!$B$81","v":"49. FWHG Site Control"},null,null,null,null,null,null,null,null,{"$f":"'Document Checklist-Full List'!$K$81","v":"Documentation of site control in accordance with §400.3, including a summary explanation of site control and values for applications with multiple or non-contiguous parcels, scattered sites, lot line adjustments, phased projects, or other complex land and acquisition transactions."},null,null,null,null,null,null,null,null,null,null,null,null,null,null,null,null,null,"Uploaded to HCD Portal?"]
[null,"File Name:",null,null,{"$f":"'Document Checklist-Full List'!$B$82","v":"50. FWHG Preliminary Title Report"},null,null,null,null,null,null,null,null,{"$f":"'Document Checklist-Full List'!$K$82","v":"Provide a preliminary report dated within 30 days of application due date. For projects developed in Indian country, an attorney’s opinion regarding chain of title and current title status is acceptable in lieu of a title report."},null,null,null,null,null,null,null,null,null,null,null,null,null,null,null,null,null,"Uploaded to HCD Portal?"]
[null,"File Name:",null,null,{"$f":"'Document Checklist-Full List'!$B$83","v":"51. FWHG Appraisal"},null,null,null,null,null,null,null,null,{"$f":"'Document Checklist-Full List'!$K$83","v":"If land cost or value is included in the development budget, an appraisal report supporting the cost or value is required. "},null,null,null,null,null,null,null,null,null,null,null,null,null,null,null,null,null,"Uploaded to HCD Portal?"]
[]
[null,"(g)","Applicant certifies that the application is complete pursuant to §501 (a-f) of these Guidelines?"]
[null,null,"§501 (f) - Below, provide a description of how the Applicant will comply with the requirements of Local Program/Project administration set forth in §204 of these Guidelines applicable to the Program or Project being applied for."]
[]
[]
[null,null,"§501 (g) - For Homeownership Development Projects, a market analysis that summarizes the local area market data that demonstrates the need for the development of additional affordable housing matching the proposed project. Include details of the targeted households and their willingness and ability to pay the proposed housing costs. Data cited in the market study should be current (within the past three years)."]
[null,"File Name:",null,null,{"$f":"'Document Checklist-Full List'!$B$84","v":"52. FWHG Market Analysis"},null,null,null,null,null,null,null,null,{"$f":"'Document Checklist-Full List'!$K$84","v":"For Homeownership Development Projects, provide a market analysis that summarizes the local area market data that demonstrates the need for the development of additional affordable housing matching the proposed project."},null,null,null,null,null,null,null,null,null,null,null,null,null,null,null,null,null,"Uploaded to HCD Portal?",null,null,null,null,null,null,null,null,null,"PASS",null,null,"PASS",null,null,"PASS"]
[]
[null,"(h)","Applicant certifies that the application shall be on the Department forms and cannot be altered or modified by the Applicant?"]
[]
[null,"(i)","Applicant certifies that it does not have any unresolved audit findings for prior Department or federally funded housing or community development Projects or Programs pursuant to §501 (c) of these Guidelines?"]
[]
[null,"(j)","Applicant certifies that it has no pending lawsuits that would impede the implementation of the Program pursuant to §501 (c) of these Guidelines?"]
[]
[null,"(k)","Applicant certifies that all Units assisted with Program funds must serve Low-Income Agricultural Households?"]
[]
[null,"(l)","Applicant acknowledges/certifies to provide a market study verifying an adequate Agricultural Worker market for their Project or Program?"]
[null,null,"(1)","The market study should include key data, ideally at the county level but at a minimum at the state level, such as those stated at §208 (l)(1-3)."]
[null,"File Name:",null,null,{"$f":"'Document Checklist-Full List'!$B$85","v":"53. FWHG Market Study"},null,null,null,null,null,null,null,null,{"$f":"'Document Checklist-Full List'!$K$85","v":"Provide a market study verifying an adequate Agricultural Worker market for their Project or Program."},null,null,null,null,null,null,null,null,null,null,null,null,null,null,null,null,null,"Uploaded to HCD?"]
[]
[null,"Applicant Notes/Comments"]
[]
[]
[null,"End of Document"]

{"sheet":"HOSN Scoring","index":12,"n_rows":418,"n_cols":49,"rows_kept":418,"cut":false,"hidden":true,"merged":[[209,42,214,42],[221,42,226,42],[228,42,233,42],[240,42,245,42],[247,42,252,42],[259,42,264,42],[266,42,271,42],[278,42,283,42],[97,42,102,42],[126,42,131,42],[92,42,94,42],[109,42,111,42],[114,42,119,42],[133,42,138,42],[145,42,150,42],[152,42,157,42],[164,42,169,42],[171,42,176,42],[183,42,188,42],[190,42,195,42],[202,42,207,42],[45,42,46,42],[62,3,62,36],[65,3,65,36],[63,37,63,38],[63,1,63,36],[66,1,66,36],[66,37,66,38],[62,42,63,42],[65,42,66,42],[80,42,85,42],[183,1,183,22],[183,23,183,28],[202,1,202,22],[202,23,202,28],[221,1,221,22],[221,23,221,28],[240,1,240,22],[240,23,240,28],[105,2,105,8],[106,1,106,3],[106,4,106,12],[106,13,106,30],[108,1,108,3],[108,4,108,12],[97,2,97,36],[140,31,140,36],[140,37,140,38],[163,37,163,38],[120,37,120,38],[121,1,121,3],[124,2,124,12],[125,1,125,3],[259,1,259,22],[259,23,259,28],[278,1,278,22],[278,23,278,28],[165,1,165,15],[165,16,165,21],[165,22,165,29],[250,9,250,24],[251,9,251,24],[268,9,268,24],[269,9,269,24],[201,4,201,12],[211,9,211,24],[212,9,212,24],[213,9,213,24],[207,1,207,15],[207,16,207,21],[207,22,207,29],[248,9,248,24],[252,2,252,8],[166,22,166,29],[196,1,196,3],[196,4,196,12],[171,2,171,36],[169,16,169,21],[169,22,169,29],[169,30,169,38],[249,9,249,24],[188,16,188,21],[188,22,188,29],[188,30,188,38],[202,29,202,36],[128,30,128,38],[129,1,129,15],[45,1,45,35],[45,36,45,37],[91,31,91,36],[69,23,69,24],[40,20,40,21],[41,20,41,21],[70,2,70,18],[70,20,70,21],[70,23,70,24],[71,2,71,18],[71,20,71,21],[86,1,86,3],[86,4,86,12],[86,13,86,30],[86,31,86,36],[120,13,120,30],[120,31,120,36],[79,2,79,38],[80,2,80,36],[80,37,80,38],[91,37,91,38],[97,37,97,38],[8,1,8,14],[8,15,8,25],[28,14,28,16],[29,11,29,13],[29,14,29,16],[29,17,29,20],[28,17,28,20],[61,2,61,36],[35,26,36,37],[37,28,37,30],[72,20,72,21],[72,23,72,24],[73,2,73,18],[64,37,64,38],[230,9,230,24],[133,2,133,36],[133,37,133,38],[134,2,134,8],[134,9,134,24],[138,2,138,8],[148,1,148,15],[148,16,148,21],[148,22,148,29],[148,30,148,38],[149,1,149,15],[139,4,139,12],[139,13,139,30],[139,31,139,36],[139,37,139,38],[140,1,140,3],[140,4,140,12],[140,13,140,30],[405,1,405,24],[410,2,410,24],[411,2,411,24],[361,27,361,31],[361,33,361,37],[362,33,362,34],[362,36,362,37],[406,2,406,24],[407,2,407,24],[408,2,408,24],[409,2,409,24],[361,2,361,18],[361,20,361,21],[361,23,361,24],[387,23,387,24],[388,2,388,18],[388,20,388,21],[388,23,388,24],[389,2,389,18],[364,23,364,24],[371,2,371,36],[371,37,371,38],[377,37,377,38],[381,37,381,38],[378,37,378,38],[379,37,379,38],[380,2,380,36],[380,37,380,38],[377,2,377,36],[381,2,381,36],[387,2,387,18],[389,20,389,21],[81,2,81,8],[303,2,305,8],[306,2,308,8],[108,13,108,30],[108,31,108,36],[304,9,304,20],[40,28,40,30],[40,33,40,35],[42,28,42,30],[41,28,41,30],[41,33,41,35],[43,28,43,30],[44,33,44,35],[270,9,270,24],[149,16,149,21],[149,22,149,29],[104,1,104,3],[98,9,98,24],[102,2,102,8],[91,4,91,12],[91,13,91,30],[286,20,287,21],[286,23,287,24],[73,20,73,21],[291,2,291,18],[126,23,126,28],[127,1,127,15],[127,16,127,21],[127,22,127,29],[127,30,127,38],[128,1,128,15],[128,16,128,21],[356,37,356,38],[319,2,320,18],[338,31,338,36],[338,37,338,38],[302,36,302,37],[329,13,329,30],[329,31,329,36],[329,37,329,38],[323,2,323,18],[323,20,323,21],[323,23,323,24],[327,2,327,36],[314,36,314,37],[317,36,317,37],[322,23,322,24],[308,36,308,37],[311,36,311,37],[346,23,347,24],[331,2,331,36],[306,9,306,20],[348,27,348,28],[330,2,330,36],[340,1,340,3],[340,4,340,12],[352,20,352,21],[319,20,320,21],[310,21,310,22],[317,9,317,35],[312,9,312,20],[313,9,313,20],[314,9,314,35],[349,2,349,18],[349,20,349,21],[334,37,334,38],[358,2,359,18],[358,20,359,21],[358,23,359,24],[309,2,311,8],[312,2,314,8],[315,2,317,8],[315,21,315,22],[316,21,316,22],[352,23,352,24],[356,2,356,36],[357,2,357,36],[344,4,344,12],[342,13,342,30],[333,2,333,36],[335,2,335,36],[312,21,312,22],[334,4,334,12],[334,13,334,30],[319,23,320,24],[321,2,321,18],[321,20,321,21],[332,1,332,3],[332,4,332,12],[334,31,334,36],[349,27,349,28],[350,27,350,28],[351,27,351,28],[352,27,352,28],[309,21,309,22],[114,37,114,38],[115,2,115,8],[115,9,115,24],[119,2,119,8],[120,1,120,3],[120,4,120,12],[231,9,231,24],[232,9,232,24],[292,2,292,18],[292,20,292,21],[292,23,292,24],[129,16,129,21],[129,22,129,29],[121,4,121,12],[121,13,121,30],[131,1,131,15],[131,16,131,21],[131,22,131,29],[121,31,121,36],[163,31,163,36],[177,1,177,3],[177,4,177,12],[177,13,177,30],[149,30,149,38],[171,37,171,38],[172,2,172,8],[142,13,142,30],[130,22,130,29],[130,30,130,38],[126,37,126,38],[126,1,126,22],[128,22,128,29],[299,37,299,38],[300,21,300,22],[301,21,301,22],[298,37,298,38],[89,13,89,30],[89,31,89,36],[108,37,108,38],[103,31,103,36],[103,37,103,38],[104,13,104,30],[104,31,104,36],[104,37,104,38],[116,9,116,24],[117,9,117,24],[118,9,118,24],[135,9,135,24],[136,9,136,24],[137,9,137,24],[154,9,154,24],[155,9,155,24],[156,9,156,24],[89,4,89,12],[288,2,288,18],[288,20,288,21],[288,23,288,24],[89,37,89,38],[91,1,91,3],[125,4,125,12],[125,13,125,30],[125,31,125,36],[125,37,125,38],[162,2,162,12],[3,36,3,38],[3,27,3,35],[417,1,417,38],[415,1,415,38],[41,23,41,24],[42,23,42,24],[43,23,43,24],[44,23,44,24],[40,2,40,18],[36,20,37,21],[36,23,37,24],[53,2,53,18],[53,20,53,21],[53,23,53,24],[54,2,54,18],[54,20,54,21],[54,23,54,24],[8,37,8,38],[291,23,291,24],[22,21,22,24],[39,23,39,24],[28,11,28,13],[339,37,339,38],[29,25,29,28],[341,2,341,36],[86,37,86,38],[85,2,85,8],[87,1,87,3],[87,4,87,12],[291,20,291,21],[88,2,88,8],[89,1,89,3],[24,1,24,7],[26,8,26,10],[26,17,26,20],[26,11,26,13],[26,14,26,16],[27,11,27,13],[26,1,26,7],[32,2,32,36],[27,8,27,10],[28,8,28,10],[29,8,29,10],[27,25,27,28],[28,25,28,28],[28,29,28,31],[29,29,29,31],[28,21,28,24],[25,1,25,7],[26,29,26,31],[26,35,26,36],[24,35,24,36],[25,35,25,36],[24,8,24,10],[24,11,24,13],[24,14,24,16],[24,17,24,20],[27,14,27,16],[26,21,26,24],[27,17,27,20],[25,21,25,24],[44,20,44,21],[44,2,44,18],[40,23,40,24],[41,2,41,18],[42,2,42,18],[43,2,43,18],[36,2,37,18],[38,2,38,18],[33,2,33,38],[27,35,27,36],[28,35,28,36],[29,35,29,36],[29,21,29,24],[28,32,28,34],[29,32,29,34],[25,17,25,20],[23,14,23,16],[37,33,37,35],[38,28,38,30],[38,33,38,35],[44,28,44,30],[42,33,42,35],[43,33,43,35],[39,28,39,30],[39,33,39,35],[38,23,38,24],[39,2,39,18],[42,20,42,21],[43,20,43,21],[27,21,27,24],[27,32,27,34],[27,29,27,31],[56,23,56,24],[57,2,57,18],[57,20,57,21],[56,2,56,18],[56,20,56,21],[64,2,64,36],[57,23,57,24],[67,2,68,18],[67,20,68,21],[67,23,68,24],[61,37,61,38],[87,13,87,30],[87,31,87,36],[103,13,103,30],[94,1,94,15],[95,1,95,3],[95,4,95,12],[93,1,93,31],[93,32,93,38],[92,1,92,36],[92,37,92,38],[94,16,94,21],[94,22,94,29],[94,30,94,38],[90,2,90,12],[87,37,87,38],[74,2,74,18],[74,20,74,21],[74,23,74,24],[75,2,75,18],[75,20,75,21],[75,23,75,24],[130,1,130,15],[374,2,374,36],[375,2,375,36],[376,2,376,36],[376,37,376,38],[362,30,362,31],[362,20,362,21],[362,2,362,18],[362,27,362,28],[362,23,362,24],[363,2,363,18],[363,20,363,21],[363,23,363,24],[364,2,364,18],[364,20,364,21],[121,37,121,38],[122,2,122,8],[123,1,123,3],[349,23,349,24],[348,20,348,21],[348,23,348,24],[337,37,337,38],[338,1,338,3],[339,2,339,36],[338,4,338,12],[338,13,338,30],[334,1,334,3],[293,2,293,18],[293,20,293,21],[293,23,293,24],[173,9,173,24],[336,13,336,30],[123,37,123,38],[15,1,15,7],[16,1,16,7],[15,11,15,13],[15,14,15,16],[15,17,15,20],[391,23,391,24],[365,2,365,18],[365,20,365,21],[365,23,365,24],[366,2,366,18],[366,20,366,21],[366,23,366,24],[383,2,384,18],[383,20,384,21],[383,23,384,24],[385,2,385,18],[385,20,385,21],[385,23,385,24],[386,2,386,18],[386,20,386,21],[386,23,386,24],[378,2,378,36],[49,2,50,18],[49,20,50,21],[389,23,389,24],[114,2,114,36],[49,23,50,24],[51,2,51,18],[51,20,51,21],[51,23,51,24],[129,30,129,38],[52,2,52,18],[73,23,73,24],[12,8,12,36],[19,8,19,10],[16,14,16,16],[16,17,16,20],[14,17,14,20],[16,8,16,10],[16,11,16,13],[15,8,15,10],[19,11,19,13],[19,14,19,16],[23,21,23,24],[19,17,19,20],[19,21,19,24],[19,25,19,28],[23,25,23,28],[22,8,22,10],[22,11,22,13],[22,14,22,16],[23,17,23,20],[23,8,23,10],[23,11,23,13],[18,8,18,10],[17,29,17,31],[18,29,18,31],[19,29,19,31],[18,21,18,24],[18,25,18,28],[17,8,17,10],[17,11,17,13],[17,14,17,16],[17,17,17,20],[16,21,16,24],[18,11,18,13],[18,14,18,16],[22,32,22,34],[123,4,123,12],[123,13,123,30],[123,31,123,36],[17,35,17,36],[18,35,18,36],[19,35,19,36],[55,2,55,18],[55,20,55,21],[55,23,55,24],[52,20,52,21],[52,23,52,24],[71,23,71,24],[72,2,72,18],[82,9,82,24],[83,9,83,24],[84,9,84,24],[81,9,81,24],[69,2,69,18],[69,20,69,21],[25,8,25,10],[25,11,25,13],[25,14,25,16],[38,20,38,21],[39,20,39,21],[27,1,27,7],[28,1,28,7],[29,1,29,7],[5,1,6,36],[22,17,22,20],[23,29,23,31],[22,29,22,31],[13,35,13,36],[14,35,14,36],[15,35,15,36],[16,35,16,36],[14,32,14,34],[13,32,13,34],[13,8,13,10],[13,11,13,13],[13,14,13,16],[13,17,13,20],[13,21,13,24],[13,25,13,28],[14,8,14,10],[14,11,14,13],[14,14,14,16],[16,32,16,34],[17,32,17,34],[18,1,18,7],[19,1,19,7],[15,29,15,31],[21,1,23,7],[22,35,23,36],[21,35,21,36],[12,1,14,7],[16,25,16,28],[17,1,17,7],[18,17,18,20],[16,29,16,31],[12,37,12,38],[16,37,16,38],[17,37,17,38],[18,37,18,38],[19,37,19,38],[13,37,14,38],[15,37,15,38],[17,25,17,28],[15,21,15,24],[15,25,15,28],[14,29,14,31],[13,29,13,31],[18,32,18,34],[19,32,19,34],[24,25,24,28],[25,25,25,28],[26,25,26,28],[24,21,24,24],[23,32,23,34],[24,32,24,34],[25,32,25,34],[26,32,26,34],[24,29,24,31],[25,29,25,31],[14,21,14,24],[14,25,14,28],[17,21,17,24],[15,32,15,34],[22,25,22,28],[400,2,400,18],[400,23,400,24],[395,2,395,18],[395,23,395,24],[398,2,398,18],[398,23,398,24],[399,2,399,18],[399,23,399,24],[396,2,396,18],[396,23,396,24],[397,2,397,18],[397,23,397,24],[390,2,390,18],[390,20,390,21],[390,23,390,24],[391,2,391,18],[391,20,391,21],[130,16,130,21],[158,4,158,12],[158,13,158,30],[158,31,158,36],[139,1,139,3],[146,1,146,15],[146,16,146,21],[146,22,146,29],[146,30,146,38],[150,22,150,29],[150,30,150,38],[172,9,172,24],[176,2,176,8],[147,1,147,15],[147,16,147,21],[147,22,147,29],[147,30,147,38],[153,2,153,8],[153,9,153,24],[157,2,157,8],[158,1,158,3],[158,37,158,38],[168,22,168,29],[168,30,168,38],[169,1,169,15],[131,30,131,38],[145,1,145,22],[145,23,145,28],[142,31,142,36],[142,37,142,38],[144,31,144,36],[144,37,144,38],[184,1,184,15],[142,4,142,12],[159,31,159,36],[159,37,159,38],[160,2,160,8],[161,1,161,3],[161,4,161,12],[161,13,161,30],[161,31,161,36],[161,37,161,38],[152,2,152,36],[152,37,152,38],[387,20,387,21],[190,37,190,38],[191,2,191,8],[191,9,191,24],[177,31,177,36],[177,37,177,38],[379,2,379,36],[360,2,360,18],[360,20,360,21],[360,23,360,24],[372,37,372,38],[373,37,373,38],[374,37,374,38],[375,37,375,38],[372,2,372,36],[373,2,373,36],[143,2,143,12],[144,1,144,3],[144,4,144,12],[144,13,144,30],[142,1,142,3],[145,37,145,38],[175,9,175,24],[167,1,167,15],[167,16,167,21],[167,22,167,29],[167,30,167,38],[168,1,168,15],[168,16,168,21],[164,1,164,22],[164,23,164,28],[150,1,150,15],[150,16,150,21],[165,30,165,38],[166,1,166,15],[166,16,166,21],[166,30,166,38],[174,9,174,24],[163,1,163,3],[163,4,163,12],[163,13,163,30],[223,22,223,29],[223,30,223,38],[224,1,224,15],[224,16,224,21],[224,22,224,29],[224,30,224,38],[225,1,225,15],[196,13,196,30],[192,9,192,24],[193,9,193,24],[194,9,194,24],[197,1,197,3],[197,4,197,12],[206,1,206,15],[206,16,206,21],[206,22,206,29],[206,30,206,38],[221,37,221,38],[216,1,216,3],[216,4,216,12],[216,13,216,30],[216,31,216,36],[216,37,216,38],[217,2,217,8],[218,1,218,3],[218,4,218,12],[218,13,218,30],[218,31,218,36],[218,37,218,38],[222,16,222,21],[222,22,222,29],[286,2,287,18],[299,2,299,36],[346,2,347,18],[346,20,347,21],[331,37,331,38],[344,37,344,38],[342,1,342,3],[342,4,342,12],[336,1,336,3],[336,4,336,12],[238,2,238,12],[239,1,239,3],[239,4,239,12],[239,13,239,30],[239,31,239,36],[239,37,239,38],[248,2,248,8],[241,1,241,15],[241,16,241,21],[241,22,241,29],[241,30,241,38],[242,1,242,15],[242,16,242,21],[242,22,242,29],[242,30,242,38],[243,1,243,15],[245,1,245,15],[245,16,245,21],[336,31,336,36],[336,37,336,38],[337,2,337,36],[332,37,332,38],[341,37,341,38],[348,2,348,18],[327,37,327,38],[305,36,305,37],[306,21,306,22],[350,2,350,18],[350,20,350,21],[350,23,350,24],[300,9,300,20],[303,21,303,22],[304,21,304,22],[298,2,298,36],[305,9,305,35],[303,9,303,20],[301,9,301,20],[302,9,302,35],[308,9,308,35],[316,9,316,20],[315,9,315,20],[310,9,310,20],[309,9,309,20],[307,21,307,22],[300,2,302,8],[333,37,333,38],[340,37,340,38],[321,23,321,24],[322,2,322,18],[322,20,322,21],[311,9,311,35],[313,21,313,22],[307,9,307,20],[332,31,332,36],[357,37,357,38],[274,2,274,8],[275,1,275,3],[275,4,275,12],[275,13,275,30],[275,31,275,36],[275,37,275,38],[276,2,276,12],[277,1,277,3],[277,4,277,12],[277,13,277,30],[277,31,277,36],[277,37,277,38],[342,31,342,36],[342,37,342,38],[343,2,343,36],[343,37,343,38],[344,1,344,3],[340,31,340,36],[351,2,351,18],[351,20,351,21],[351,23,351,24],[344,13,344,30],[344,31,344,36],[352,2,352,18],[340,13,340,30],[335,37,335,38],[294,2,294,18],[294,20,294,21],[294,23,294,24],[289,2,289,18],[289,20,289,21],[289,23,289,24],[290,2,290,18],[290,20,290,21],[290,23,290,24],[330,37,330,38],[328,2,328,36],[328,37,328,38],[329,1,329,3],[329,4,329,12],[332,13,332,30],[164,37,164,38],[159,1,159,3],[159,4,159,12],[159,13,159,30],[183,37,183,38],[178,13,178,30],[178,31,178,36],[178,37,178,38],[181,2,181,12],[182,1,182,3],[182,4,182,12],[182,13,182,30],[182,31,182,36],[182,37,182,38],[178,1,178,3],[178,4,178,12],[179,2,179,8],[180,1,180,3],[180,4,180,12],[180,13,180,30],[215,31,215,36],[254,1,254,3],[110,1,110,31],[110,32,110,38],[109,1,109,36],[109,37,109,38],[111,1,111,15],[111,16,111,21],[111,22,111,29],[111,30,111,38],[112,1,112,3],[112,4,112,12],[112,13,112,30],[112,31,112,36],[112,37,112,38],[106,37,106,38],[95,13,95,30],[95,31,95,36],[95,37,95,38],[103,1,103,3],[103,4,103,12],[104,4,104,12],[107,2,107,12],[99,9,99,24],[100,9,100,24],[101,9,101,24],[106,31,106,36],[98,2,98,8],[180,31,180,36],[180,37,180,38],[254,31,254,36],[254,37,254,38],[255,2,255,8],[256,1,256,3],[256,4,256,12],[256,13,256,30],[256,31,256,36],[256,37,256,38],[247,2,247,36],[247,37,247,38],[243,16,243,21],[243,22,243,29],[219,2,219,12],[220,1,220,3],[220,4,220,12],[220,13,220,30],[220,31,220,36],[253,1,253,3],[253,4,253,12],[253,13,253,30],[253,31,253,36],[253,37,253,38],[236,2,236,8],[237,1,237,3],[237,4,237,12],[199,31,199,36],[199,37,199,38],[237,13,237,30],[237,31,237,36],[237,37,237,38],[141,2,141,8],[187,30,187,38],[414,1,414,8],[10,1,10,38],[278,37,278,38],[240,37,240,38],[259,37,259,38],[273,1,273,3],[273,4,273,12],[273,13,273,30],[273,31,273,36],[273,37,273,38],[271,2,271,8],[272,1,272,3],[272,4,272,12],[272,13,272,30],[272,31,272,36],[272,37,272,38],[257,2,257,12],[220,37,220,38],[197,13,197,30],[197,31,197,36],[197,37,197,38],[214,2,214,8],[215,1,215,3],[215,4,215,12],[215,13,215,30],[204,22,204,29],[204,30,204,38],[254,4,254,12],[254,13,254,30],[187,1,187,15],[187,16,187,21],[187,22,187,29],[209,2,209,36]],"merged_total":1189,"flags":["merged_cut"]}
[]
[]
[null,null,null,null,null,null,null,null,null,null,null,null,null,null,null,null,null,null,null,null,null,null,null,null,null,null,null,null,null,null,null,null,null,null,null,null,null,null,null,null,null,"Reviewer 1","Comments",null,"Reviewer 2","Comments",null,"Manager Review","Comments"]
[null,null,null,null,null,null,null,null,null,null,null,null,null,null,null,null,null,null,null,null,null,null,null,null,null,null,null,"Application due date:",null,null,null,null,null,null,null,null,{"$f":"Appduedate","v":"2025-02-13"},null,null,null,null,null,{"$f":"IF(OR(AP16=\"Adjust\",AP17=\"Adjust\",AP18=\"Adjust\",AP19=\"Adjust\",AP20=\"Adjust\",AP25=\"Adjust\",AP26=\"Adjust\",AP27=\"Adjust\",AP28=\"Adjust\",AP29=\"Adjust\",AP30=\"Adjust\",AP46=\"Adjust\",AP52=\"Adjust\",AP53=\"Adjust\",AP54=\"Adjust\",AP55=\"Adjust\",AP56=\"Adjust\",AP57=\"Adjust\",AP58=\"Adjust\",AP64=\"Adjust\",AP67=\"Adjust\",AP70=\"Adjust\",AP71=\"Adjust\",AP72=\"Adjust\",AP73=\"Adjust\",AP74=\"Adjust\",AP75=\"Adjust\",AP76=\"Adjust\",AP81=\"Adjust\",AP93=\"Adjust\",AP98=\"Adjust\",AP110=\"Adjust\",AP115=\"Adjust\",AP127=\"Adjust\",AP134=\"Adjust\",AP146=\"Adjust\",AP153=\"Adjust\",AP165=\"Adjust\",AP172=\"Adjust\",AP184=\"Adjust\",AP191=\"Adjust\",AP203=\"Adjust\",AP210=\"Adjust\",AP222=\"Adjust\",AP229=\"Adjust\",AP241=\"Adjust\",AP248=\"Adjust\",AP260=\"Adjust\",AP267=\"Adjust\",AP279=\"Adjust\",AP289=\"Adjust\",AP290=\"Adjust\",AP291=\"Adjust\",AP292=\"Adjust\",AP293=\"Adjust\",AP294=\"Adjust\",AP295=\"Adjust\",AP299=\"Adjust\",AP300=\"Adjust\",AP322=\"Adjust\",AP323=\"Adjust\",AP324=\"Adjust\",AP328=\"Adjust\",AP331=\"Adjust\",AP349=\"Adjust\",AP350=\"Adjust\",AP351=\"Adjust\",AP352=\"Adjust\",AP353=\"Adjust\",AP357=\"Adjust\",AP358=\"Adjust\",AP361=\"Adjust\",AP362=\"Adjust\",AP363=\"Adjust\",AP364=\"Adjust\",AP365=\"Adjust\",AP366=\"Adjust\",AP367=\"Adjust\",AP386=\"Adjust\",AP387=\"Adjust\",AP388=\"Adjust\",AP389=\"Adjust\",AP390=\"Adjust\",AP391=\"Adjust\",AP392=\"Adjust\",AP397=\"Adjust\",AP398=\"Adjust\",AP399=\"Adjust\",AP400=\"Adjust\",AP401=\"Adjust\"),\"Adjust\",\"Verified\")","v":"Verified"},null,null,{"$f":"IF(OR(AS16=\"Adjust\",AS17=\"Adjust\",AS18=\"Adjust\",AS19=\"Adjust\",AS20=\"Adjust\",AS25=\"Adjust\",AS26=\"Adjust\",AS27=\"Adjust\",AS28=\"Adjust\",AS29=\"Adjust\",AS30=\"Adjust\",AS46=\"Adjust\",AS52=\"Adjust\",AS53=\"Adjust\",AS54=\"Adjust\",AS55=\"Adjust\",AS56=\"Adjust\",AS57=\"Adjust\",AS58=\"Adjust\",AS64=\"Adjust\",AS67=\"Adjust\",AS70=\"Adjust\",AS71=\"Adjust\",AS72=\"Adjust\",AS73=\"Adjust\",AS74=\"Adjust\",AS75=\"Adjust\",AS76=\"Adjust\",AS81=\"Adjust\",AS93=\"Adjust\",AS98=\"Adjust\",AS110=\"Adjust\",AS115=\"Adjust\",AS127=\"Adjust\",AS134=\"Adjust\",AS146=\"Adjust\",AS153=\"Adjust\",AS165=\"Adjust\",AS172=\"Adjust\",AS184=\"Adjust\",AS191=\"Adjust\",AS203=\"Adjust\",AS210=\"Adjust\",AS222=\"Adjust\",AS229=\"Adjust\",AS241=\"Adjust\",AS248=\"Adjust\",AS260=\"Adjust\",AS267=\"Adjust\",AS279=\"Adjust\",AS289=\"Adjust\",AS290=\"Adjust\",AS291=\"Adjust\",AS292=\"Adjust\",AS293=\"Adjust\",AS294=\"Adjust\",AS295=\"Adjust\",AS299=\"Adjust\",AS300=\"Adjust\",AS322=\"Adjust\",AS323=\"Adjust\",AS324=\"Adjust\",AS328=\"Adjust\",AS331=\"Adjust\",AS349=\"Adjust\",AS350=\"Adjust\",AS351=\"Adjust\",AS352=\"Adjust\",AS353=\"Adjust\",AS357=\"Adjust\",AS358=\"Adjust\",AS361=\"Adjust\",AS362=\"Adjust\",AS363=\"Adjust\",AS364=\"Adjust\",AS365=\"Adjust\",AS366=\"Adjust\",AS367=\"Adjust\",AS386=\"Adjust\",AS387=\"Adjust\",AS388=\"Adjust\",AS389=\"Adjust\",AS390=\"Adjust\",AS391=\"Adjust\",AS392=\"Adjust\",AS397=\"Adjust\",AS398=\"Adjust\",AS399=\"Adjust\",AS400=\"Adjust\",AS401=\"Adjust\"),\"Adjust\",\"Verified\")","v":"Verified"},null,null,{"$f":"IF(OR(AV16=\"Adjust\",AV17=\"Adjust\",AV18=\"Adjust\",AV19=\"Adjust\",AV20=\"Adjust\",AV25=\"Adjust\",AV26=\"Adjust\",AV27=\"Adjust\",AV28=\"Adjust\",AV29=\"Adjust\",AV30=\"Adjust\",AV46=\"Adjust\",AV52=\"Adjust\",AV53=\"Adjust\",AV54=\"Adjust\",AV55=\"Adjust\",AV56=\"Adjust\",AV57=\"Adjust\",AV58=\"Adjust\",AV64=\"Adjust\",AV67=\"Adjust\",AV70=\"Adjust\",AV71=\"Adjust\",AV72=\"Adjust\",AV73=\"Adjust\",AV74=\"Adjust\",AV75=\"Adjust\",AV76=\"Adjust\",AV81=\"Adjust\",AV93=\"Adjust\",AV98=\"Adjust\",AV110=\"Adjust\",AV115=\"Adjust\",AV127=\"Adjust\",AV134=\"Adjust\",AV146=\"Adjust\",AV153=\"Adjust\",AV165=\"Adjust\",AV172=\"Adjust\",AV184=\"Adjust\",AV191=\"Adjust\",AV203=\"Adjust\",AV210=\"Adjust\",AV222=\"Adjust\",AV229=\"Adjust\",AV241=\"Adjust\",AV248=\"Adjust\",AV260=\"Adjust\",AV267=\"Adjust\",AV279=\"Adjust\",AV289=\"Adjust\",AV290=\"Adjust\",AV291=\"Adjust\",AV292=\"Adjust\",AV293=\"Adjust\",AV294=\"Adjust\",AV295=\"Adjust\",AV299=\"Adjust\",AV300=\"Adjust\",AV322=\"Adjust\",AV323=\"Adjust\",AV324=\"Adjust\",AV328=\"Adjust\",AV331=\"Adjust\",AV349=\"Adjust\",AV350=\"Adjust\",AV351=\"Adjust\",AV352=\"Adjust\",AV353=\"Adjust\",AV357=\"Adjust\",AV358=\"Adjust\",AV361=\"Adjust\",AV362=\"Adjust\",AV363=\"Adjust\",AV364=\"Adjust\",AV365=\"Adjust\",AV366=\"Adjust\",AV367=\"Adjust\",AV386=\"Adjust\",AV387=\"Adjust\",AV388=\"Adjust\",AV389=\"Adjust\",AV390=\"Adjust\",AV391=\"Adjust\",AV392=\"Adjust\",AV397=\"Adjust\",AV398=\"Adjust\",AV399=\"Adjust\",AV400=\"Adjust\",AV401=\"Adjust\"),\"Adjust\",\"Verified\")","v":"Verified"}]
[]
[null,"NOFA §II (E)(2) Program Requirements\nMinimum Point Score: Applicants must achieve a minimum point score of 55 points in the Base Evaluation Criteria in Section IV of this HOSN to be considered for a funding Award."]
[]
[]
[null,"NOFA §II (G)(1-2) Applicant acknowledges and understand",null,null,null,null,null,null,null,null,null,null,null,null,null,"Negative Points and Disencumbrance Policies?"]
[]
[null,"Summary table(s) of point base criteria."]
[]
[null," FWHG Program\nSummary Table (Scoring)",null,null,null,null,null,null,"Max possible Score  (per Eligible Activity)"]
[null,null,null,null,null,null,null,null,40,null,null,15,null,null,15,null,null,10,null,null,null,5,null,null,null,5,null,null,null,5,null,null,5,null,null,30,null,"Total Points"]
[null,null,null,null,null,null,null,null,"Capability",null,null,"Community Need",null,null,"Feasibility",null,null,"Community Revitalization",null,null,null,"Volunteer, Self-Help, and Youth Training",null,null,null,"Increases Affordable Housing Supply",null,null,null,"Prospective Households Served",null,null,"Pro-Housing Designation",null,null,"Farm-\nworker Need "]
[null,"Homeownership Development Project Loans",null,null,null,null,null,null,{"$f":"$X$39","v":0},null,null,{"$f":"$X$52","v":0},null,null,{"$f":"$X$70","v":0},null,null,{"$f":"$X$289","v":0},null,null,null,{"$f":"$X$322","v":0},null,null,null,{"$f":"$X$349","v":0},null,null,null,{"$f":"X361","v":false},null,null,{"$f":"$X$386","v":0},null,null,{"$f":"$X$397","v":0},null,{"$f":"SUM(I16:AK16)","v":0}]
[null,"Self-Help Technical Assistance Grants",null,null,null,null,null,null,{"$f":"$X$40","v":0},null,null,{"$f":"IFERROR($X$53,0)","v":0},null,null,{"$f":"$X$71","v":0},null,null,{"$f":"$X$290","v":0},null,null,null,{"$f":"$X$323","v":0},null,null,null,{"$f":"$X$350","v":0},null,null,null,{"$f":"X362","v":false},null,null,{"$f":"$X$387","v":0},null,null,{"$f":"IFERROR($X$398,0)","v":0},null,{"$f":"SUM(I17:AK17)","v":0}]
[null,"Mortgage Assistance Grants",null,null,null,null,null,null,{"$f":"$X$41","v":0},null,null,{"$f":"IFERROR($X$54,0)","v":0},null,null,{"$f":"IFERROR($X$72,0)","v":0},null,null,{"$f":"$X$291","v":0},null,null,null,{"$f":"$X$324","v":0},null,null,null,{"$f":"$X$351","v":0},null,null,null,{"$f":"X363","v":false},null,null,{"$f":"$X$388","v":0},null,null,{"$f":"IFERROR($X$399,0)","v":0},null,{"$f":"SUM(I18:AK18)","v":0}]
[null,"Owner-Occupied Rehabilitation Grants",null,null,null,null,null,null,{"$f":"$X$42","v":0},null,null,{"$f":"IFERROR($X$55,0)","v":0},null,null,{"$f":"IFERROR($X$73,0)","v":0},null,null,{"$f":"$X$292","v":0},null,null,null,"N/A",null,null,null,"N/A",null,null,null,{"$f":"X364","v":false},null,null,{"$f":"$X$389","v":0},null,null,{"$f":"IFERROR($X$400,0)","v":0},null,{"$f":"SUM(I19:AK19)","v":0}]
[null,"Acquisition of Manufactured Housing Grants",null,null,null,null,null,null,{"$f":"$X$45","v":0},null,null,{"$f":"IFERROR($X$58,0)","v":0},null,null,{"$f":"$X$76","v":0},null,null,{"$f":"$X$295","v":0},null,null,null,"N/A",null,null,null,{"$f":"X353","v":0},null,null,null,{"$f":"X367","v":false},null,null,{"$f":"$X$392","v":0},null,null,{"$f":"IFERROR($X$401,0)","v":0},null,{"$f":"SUM(I20:AK20)","v":0}]
[]
[null," CalHome Program\nSummary Table (Scoring)",null,null,null,null,null,null,"Max possible Score (per Eligible Activity)"]
[null,null,null,null,null,null,null,null,40,null,null,15,null,null,15,null,null,10,null,null,null,5,null,null,null,5,null,null,null,5,null,null,5,null,null,"Total Points"]
[null,null,null,null,null,null,null,null,"Capability",null,null,"Community Need",null,null,"Feasibility",null,null,"Community Revitalization",null,null,null,"Volunteer, Self-Help, and Youth Training",null,null,null,"Increases Affordable Housing Supply",null,null,null,"Prospective Households Served",null,null,"Pro-Housing Designation"]
[null,"Homeownership Development Project Loans",null,null,null,null,null,null,{"$f":"$U$39","v":0},null,null,{"$f":"IFERROR($U$52,0)","v":0},null,null,{"$f":"$U$70","v":0},null,null,{"$f":"$U$289","v":0},null,null,null,{"$f":"$U$322","v":0},null,null,null,{"$f":"$U$349","v":0},null,null,null,{"$f":"$U$361","v":false},null,null,{"$f":"$U$386","v":0},null,null,{"$f":"SUM(I25:AI25)","v":0}]
[null,"Self-Help Technical Assistance Grants",null,null,null,null,null,null,{"$f":"$U$40","v":0},null,null,{"$f":"IFERROR($U$53,0)","v":0},null,null,{"$f":"$U$71","v":0},null,null,{"$f":"$U$290","v":0},null,null,null,{"$f":"$U$323","v":0},null,null,null,{"$f":"$U$350","v":0},null,null,null,{"$f":"$U$362","v":false},null,null,{"$f":"$U$387","v":0},null,null,0]
[null,"Mortgage Assistance Grants",null,null,null,null,null,null,{"$f":"$U$41","v":0},null,null,{"$f":"IFERROR($U$54,0)","v":0},null,null,{"$f":"IFERROR($U$72,0)","v":0},null,null,{"$f":"$U$291","v":0},null,null,null,{"$f":"$U$324","v":0},null,null,null,{"$f":"$U$351","v":0},null,null,null,{"$f":"$U$363","v":false},null,null,{"$f":"$U$388","v":0},null,null,0]
[null,"Owner-Occupied Rehabilitation Grants",null,null,null,null,null,null,{"$f":"$U$42","v":0},null,null,{"$f":"IFERROR($U$55,0)","v":0},null,null,{"$f":"IFERROR($U$73,0)","v":0},null,null,{"$f":"$U$292","v":0},null,null,null,"N/A",null,null,null,"N/A",null,null,null,{"$f":"$U$364","v":false},null,null,{"$f":"$U$389","v":0},null,null,0]
[null,"Shared Housing Grants",null,null,null,null,null,null,{"$f":"$U$43","v":0},null,null,{"$f":"IFERROR($U$56,0)","v":0},null,null,{"$f":"IFERROR($U$74,0)","v":0},null,null,{"$f":"$U$293","v":0},null,null,null,"N/A",null,null,null,"N/A",null,null,null,{"$f":"$U$365","v":false},null,null,{"$f":"$U$390","v":0},null,null,0]
[null,"ADUs / JADU Grants",null,null,null,null,null,null,{"$f":"$U$44","v":0},null,null,{"$f":"IFERROR($U$57,0)","v":0},null,null,{"$f":"IFERROR($U$75,)","v":0},null,null,{"$f":"$U$294","v":0},null,null,null,"N/A",null,null,null,{"$f":"$U$352","v":0},null,null,null,{"$f":"$U$366","v":false},null,null,{"$f":"$U$391","v":0},null,null,0]
[]
[]
[null,"§IV","Evaluation Criteria"]
[null,null,"See NOFA §IV for complete base evaluation criteria language."]
[]
[null,null,null,null,null,null,null,null,null,null,null,null,null,null,null,null,null,null,null,null,null,null,null,null,null,null,"For HDPL number of projects completed. For all other programs specify units completed."]
[null,null,"Capability",null,null,null,null,null,null,null,null,null,null,null,null,null,null,null,null,null,"Cal\nHome",null,null,"FWHG"]
[null,null,null,null,null,null,null,null,null,null,null,null,null,null,null,null,null,null,null,null,null,null,null,null,null,null,null,null,"CalHome",null,null,null,null,"FWHG"]
[null,null,"Homeownership Development Project Loans",null,null,null,null,null,null,null,null,null,null,null,null,null,null,null,null,null,{"$f":"IF(AND(IsCalhome,IsHDPL,$AC$39=2),20,IF(AND(IsCalhome,IsHDPL,$AC$39>2,$AC$39<=4),30,IF(AND(IsCalhome,IsHDPL,$AC$39>=5),40,0)))","v":0},null,null,{"$f":"IF(AND(IsSerna,IsJHDPL,$AH$39=2),20,IF(AND(IsSerna,IsJHDPL,$AH$39>2,$AH$39<=4),30,IF(AND(IsSerna,IsJHDPL,$AH$39>=5),40,0)))","v":0}]
[null,null,"Self-Help Technical Assistance Grants",null,null,null,null,null,null,null,null,null,null,null,null,null,null,null,null,null,{"$f":"IF(AND(IsCalhome,IsSHTA,$AC$40>=2,$AC$40<=10),20,IF(AND(IsCalhome,IsSHTA,$AC$40>=11,$AC$40<=20),30,IF(AND(IsCalhome,IsSHTA,$AC$40>=21),40,0)))","v":0},null,null,{"$f":"IF(AND(IsSerna,IsJSHTA,$AH$40>=2,$AH$40<=10),20,IF(AND(IsSerna,IsJSHTA,$AH$40>=11,$AH$40<=20),30,IF(AND(IsSerna,IsJSHTA,$AH$40>=21),40,0)))","v":0}]
[null,null,"Mortgage Assistance Grants",null,null,null,null,null,null,null,null,null,null,null,null,null,null,null,null,null,{"$f":"IF(AND(IsCalhome,IsMA,$AC$41>=2,$AC$41<=5),20,IF(AND(IsCalhome,IsMA,$AC$41>=6,$AC$41<=10),30,IF(AND(IsCalhome,IsMA,$AC$41>=11),40,0)))","v":0},null,null,{"$f":"IF(AND(IsSerna,IsJMA,$AH$41>=2,$AH$41<=5),20,IF(AND(IsSerna,IsJMA,$AH$41>=6,$AH$41<=10),30,IF(AND(IsSerna,IsJMA,$AH$41>=11),40,0)))","v":0}]
[null,null,"Owner-Occupied Rehabilitation Grants",null,null,null,null,null,null,null,null,null,null,null,null,null,null,null,null,null,{"$f":"IF(AND(IsCalhome,IsOOR,$AC$42>=2,$AC$42<=5),20,IF(AND(IsCalhome,IsOOR,$AC$42>=6,$AC$42<=10),30,IF(AND(IsCalhome,IsOOR,$AC$42>=11),40,0)))","v":0},null,null,{"$f":"IF(AND(IsSerna,IsJOOR,$AH$42>=2,$AH$42<=5),20,IF(AND(IsSerna,IsJOOR,$AH$42>=6,$AH$42<=10),30,IF(AND(IsSerna,IsJOOR,$AH$42>=11),40,0)))","v":0}]
[null,null,"Shared Housing Grants",null,null,null,null,null,null,null,null,null,null,null,null,null,null,null,null,null,{"$f":"IF(AND(IsCalhome,IsSH,AC43=2),20,IF(AND(IsCalhome,IsSH,AC43>=3,AC43<=4),30,IF(AND(IsCalhome,IsSH,AC43>=5),40,0)))","v":0},null,null,"N/A",null,null,null,null,null,null,null,null,null,"N/A"]
[null,null,"Accessory Dwelling Units/Junior Accessory Dwelling Units Grants",null,null,null,null,null,null,null,null,null,null,null,null,null,null,null,null,null,{"$f":"IF(AND(IsCalhome,IsJADU,$AC$44>=2,$AC$44<=5),20,IF(AND(IsCalhome,IsJADU,$AC$44>=6,$AC$44<=10),30,IF(AND(IsCalhome,IsJADU,$AC$44>=11),40,0)))","v":0},null,null,"N/A",null,null,null,null,null,null,null,null,null,"N/A"]
[null,null,"Acquisition of Manufactured Housing Grants",null,null,null,null,null,null,null,null,null,null,null,null,null,null,null,null,null,"N/A",null,null,{"$f":"IF(AND(IsSerna,IsJAMH,$AH$45>=2,$AH$45<=5),20,IF(AND(IsSerna,IsJAMH,$AH$45>=6,$AH$45<=10),30,IF(AND(IsSerna,IsJAMH,$AH$45>=11),40,0)))","v":0},null,null,null,null,"N/A"]
[null,"Applicant acknowledges that the Department may request evidence for the number of units or projects assisted within the last four years?"]
[]
[]
[]
[null,null,"Community Need",null,null,null,null,null,null,null,null,null,null,null,null,null,null,null,null,null,"Cal\nHome",null,null,"FWHG"]
[]
[null,null,"Homeownership Development Project Loans",null,null,null,null,null,null,null,null,null,null,null,null,null,null,null,null,null,{"$f":"IFERROR(IF(AND(IsCalhome,IsHDPL),VLOOKUP('Project Overview'!F99,CountyScoresTbl[],10,FALSE),0),0)","v":0},null,null,{"$f":"IFERROR(IF(AND(IsJSerna,IsJHDPL),VLOOKUP('Project Overview'!F108,CountyScoresTbl[],10,FALSE),0),0)","v":0}]
[null,null,"Self-Help Technical Assistance Grants",null,null,null,null,null,null,null,null,null,null,null,null,null,null,null,null,null,{"$f":"IFERROR(IF(AND(IsCalhome,IsSHTA),VLOOKUP('Project Overview'!F117,CountyScoresTbl[],10,FALSE),0),0)","v":0},null,null,{"$f":"IFERROR(IF(AND(IsJSerna,IsJSHTA),VLOOKUP('Project Overview'!F126,CountyScoresTbl[],10,FALSE),0),0)","v":0}]
[null,null,"Mortgage Assistance Grants",null,null,null,null,null,null,null,null,null,null,null,null,null,null,null,null,null,{"$f":"IFERROR(IF(AND(IsCalhome,IsMA),VLOOKUP('Project Overview'!F135,CountyScoresTbl[],10,FALSE),0),0)","v":0},null,null,{"$f":"IFERROR(IF(AND(IsJSerna,IsJMA),VLOOKUP('Project Overview'!F144,CountyScoresTbl[],10,FALSE),0),0)","v":0}]
[null,null,"Owner-Occupied Rehabilitation Grants",null,null,null,null,null,null,null,null,null,null,null,null,null,null,null,null,null,{"$f":"IFERROR(IF(AND(IsCalhome,IsOOR),VLOOKUP('Project Overview'!F153,CountyScoresTbl[],19,FALSE),0),0)","v":0},null,null,{"$f":"IFERROR(IF(AND(IsJSerna,IsJOOR),VLOOKUP('Project Overview'!F162,CountyScoresTbl[],19,FALSE),0),0)","v":0}]
[null,null,"Shared Housing Grants",null,null,null,null,null,null,null,null,null,null,null,null,null,null,null,null,null,{"$f":"IFERROR(IF(AND(IsCalhome,IsSH),VLOOKUP('Project Overview'!F171,CountyScoresTbl[],10,FALSE),0),0)","v":0},null,null,"N/A"]
[null,null,"Accessory Dwelling Units/Junior Accessory Dwelling Units Grants",null,null,null,null,null,null,null,null,null,null,null,null,null,null,null,null,null,{"$f":"IFERROR(IF(AND(IsCalhome,IsJADU),VLOOKUP('Project Overview'!F177,CountyScoresTbl[],10,FALSE),0),0)","v":0},null,null,"N/A"]
[null,null,"Acquisition of Manufactured Housing Grants",null,null,null,null,null,null,null,null,null,null,null,null,null,null,null,null,null,"N/A",null,null,{"$f":"IFERROR(IF(AND(IsJSerna,IsJAMH),VLOOKUP('Project Overview'!F186,CountyScoresTbl[],10,FALSE),0),0)","v":0}]
[]
[]
[]
[null,null,"CalHome \"Mortgage Assistance Grants only\" For this Application, does the Applicant have housing newly constructed by the Applicant using funds other than CalHome or Serna funds, or housing newly acquired and substantially rehabilitated by the Applicant using funds other than CalHome or Serna funds for sale to first-time homebuyers?"]
[]
[null,"Applicant acknowledges that the Department may request evidence for the housing newly acquired and sources used to acquired such housing?"]
[null,null,"FWHG \"Mortgage Assistance Grants only\" For this Application, does the Applicant have housing newly constructed by the Applicant using funds other than CalHome or Serna funds, or housing newly acquired and substantially rehabilitated by the Applicant using funds other than CalHome or Serna funds for sale to first-time homebuyers?"]
[]
[null,"Applicant acknowledges that the Department may request evidence for the housing newly acquired and sources used to acquired such housing?"]
[null,null,"Feasibility",null,null,null,null,null,null,null,null,null,null,null,null,null,null,null,null,null,"Cal\nHome",null,null,"FWHG"]
[]
[null,null,"Homeownership Development Project Loans",null,null,null,null,null,null,null,null,null,null,null,null,null,null,null,null,null,{"$f":"IF(AND(IsCalhome,IsHDPL),15,0)","v":0},null,null,{"$f":"IF(AND(IsJSerna,IsJHDPL),15,0)","v":0}]
[null,null,"Self-Help Technical Assistance Grants",null,null,null,null,null,null,null,null,null,null,null,null,null,null,null,null,null,{"$f":"IF(AND(IsCalhome,IsSHTA),15,0)","v":0},null,null,{"$f":"IF(AND(IsJSerna,IsJSHTA),15,0)","v":0}]
[null,null,"Mortgage Assistance Grants",null,null,null,null,null,null,null,null,null,null,null,null,null,null,null,null,null,{"$f":"IFERROR(IF(AND(IsCalhome,IsMA,$AL$62=\"Yes\"),15,IF(AND(IsCalhome,IsMA),VLOOKUP('Project Overview'!F135,CountyScoresTbl[],33,FALSE),0)),0)","v":0},null,null,{"$f":"IFERROR(IF(AND(IsJSerna,IsJMA,$AL$65=\"Yes\"),15,IF(AND(IsJSerna,IsJMA),VLOOKUP('Project Overview'!F144,CountyScoresTbl[],34,FALSE),0)),0)","v":0}]
[null,null,"Owner-Occupied Rehabilitation Grants",null,null,null,null,null,null,null,null,null,null,null,null,null,null,null,null,null,{"$f":"IFERROR(IF(AND(IsCalhome,IsOOR),VLOOKUP('Project Overview'!F153,CountyScoresTbl[],39,FALSE),0),0)","v":0},null,null,{"$f":"IFERROR(IF(AND(IsJSerna,IsJOOR),VLOOKUP('Project Overview'!F162,CountyScoresTbl[],39,FALSE),0),0)","v":0}]
[null,null,"Shared Housing Grants",null,null,null,null,null,null,null,null,null,null,null,null,null,null,null,null,null,{"$f":"IFERROR(IF(AND(IsCalhome,IsSH),VLOOKUP('Project Overview'!F171,CountyScoresTbl[],44,FALSE),0),0)","v":0},null,null,"N/A"]
[null,null,"Accessory Dwelling Units/Junior Accessory Dwelling Units Grants",null,null,null,null,null,null,null,null,null,null,null,null,null,null,null,null,null,{"$f":"IFERROR(IF(AND(IsCalhome,IsJADU),VLOOKUP('Project Overview'!F177,CountyScoresTbl[],39,FALSE),0),0)","v":0},null,null,"N/A"]
[null,null,"Acquisition of Manufactured Housing Grants",null,null,null,null,null,null,null,null,null,null,null,null,null,null,null,null,null,"N/A",null,null,{"$f":"IF(AND(IsJSerna,IsJAMH,vmSiteControl2=\"Yes\"),15,IF(AND(IsJSerna,IsJAMH),10,0))","v":0}]
[]
[]
[]
[null,null,"APPENDIX A- DEFINITIONS: Community Revitalization - A Program or Project will be considered to contribute towards Community Revitalization if all Units to be assisted with Program funds are, or will be, located within a federal Promise Zone, a Choice Neighborhood Initiative Area, an Opportunity Zone, or a federally designated Justice40 Initiative disadvantaged community."]
[null,null,"CalHome \"Homeownership Development Project Loans only\" Are all Units, or will all Units be located within a federal Promise Zone, a Choice Neighborhood Initiative Area, an Opportunity Zone, or a federally designated Justice40 Initiative disadvantaged community?"]
[null,null,"Select all that apply:"]
[]
[]
[]
[null,null,"Federal Promise Zone Tool"]
[null,"File Name:",null,null,{"$f":"'Document Checklist-Full List'!$B$88","v":"54. CalHome HDPL Federal Promise Zone"},null,null,null,null,null,null,null,null,{"$f":"'Document Checklist-Full List'!$K$88","v":"Provide a Project/Program area map, indicate the approximate location of the Project/Program on the map."},null,null,null,null,null,null,null,null,null,null,null,null,null,null,null,null,null,"Uploaded to HCD?"]
[null,"File Name:",null,null,{"$f":"'Document Checklist-Full List'!$B$89","v":"55. CalHome HDPL Choice Neighborhood Initiative Area"},null,null,null,null,null,null,null,null,{"$f":"'Document Checklist-Full List'!$K$89","v":"Provide documentation that ensures all units are or will be within a Choice Neighborhood Initiative Area."},null,null,null,null,null,null,null,null,null,null,null,null,null,null,null,null,null,"Uploaded to HCD?"]
[null,null,"Opportunity Zone Tool"]
[null,"File Name:",null,null,{"$f":"'Document Checklist-Full List'!$B$90","v":"56. CalHome HDPL Opportunity Zone"},null,null,null,null,null,null,null,null,{"$f":"'Document Checklist-Full List'!$K$90","v":"Provide a Project/Program opportunity zone map, indicate the approximate location of the Project/Program on the map."},null,null,null,null,null,null,null,null,null,null,null,null,null,null,null,null,null,"Uploaded to HCD?"]
[null,null,"Climate and Economic Justice Screening Tool"]
[null,"File Name:",null,null,{"$f":"'Document Checklist-Full List'!$B$91","v":"57. CalHome HDPL Justice40 Initiative"},null,null,null,null,null,null,null,null,{"$f":"'Document Checklist-Full List'!$K$91","v":"Provide a Project/Program disadvantaged community map, indicate the approximate location(s) of the Project/Program on the map."},null,null,null,null,null,null,null,null,null,null,null,null,null,null,null,null,null,"Uploaded to HCD?"]
[null,"Are all units to be assisted with program funds located in a High or Highest Resource Area per TCAC/HCD Opportunity Area Map available at the time of application?"]
[null,"Identify the Resource Area per TCAC/HCD Opportunity Area Map. Applicant may choose to utilize a Resource Area designation from the TCAC/HCD Opportunity Area Maps in effect when the initial site control (pursuant to §400.3) was obtained, if a TCAC/HCD Opportunity Area Map exists for that year.",null,null,null,null,null,null,null,null,null,null,null,null,null,null,null,null,null,null,null,null,null,null,null,null,null,null,null,null,null,null,"https://www.treasurer.ca.gov/ctcac/opportunity.asp"]
[null,"Enter the entire TCAC/HCD Opportunity Area Map Tract ID #:",null,null,null,null,null,null,null,null,null,null,null,null,null,null,null,null,null,null,null,null,"Opportunity Area Map Category: "]
[null,"File Name:",null,null,{"$f":"'Document Checklist-Full List'!$B$31","v":"05. Opportunity Area "},null,null,null,null,null,null,null,null,{"$f":"'Document Checklist-Full List'!$K$31","v":"Documentation of TCAC/HCD Opportunity Area status either (1) at time of application, or (2) when initial site control (pursuant to §400.3) was obtained, if a TCAC/HCD Opportunity Area Map exists for that year."},null,null,null,null,null,null,null,null,null,null,null,null,null,null,null,null,null,"Uploaded to HCD?"]
[]
[null,null,"FWHG \"Homeownership Development Project Loans only\" Are all Units, or will all Units be located within a federal Promise Zone, a Choice Neighborhood Initiative Area, an Opportunity Zone, or a federally designated Justice40 Initiative disadvantaged community?"]
[null,null,"Select from dropdown menu:"]
[]
[]
[]
[null,null,"Federal Promise Zone Tool"]
[null,"File Name:",null,null,{"$f":"'Document Checklist-Full List'!B92","v":"58. FWHG HDPL Federal Promise Zone"},null,null,null,null,null,null,null,null,{"$f":"'Document Checklist-Full List'!K92","v":"Provide a Project/Program area map, indicate the approximate location of the Project/Program on the map."},null,null,null,null,null,null,null,null,null,null,null,null,null,null,null,null,null,"Uploaded to HCD?"]
[null,"File Name:",null,null,{"$f":"'Document Checklist-Full List'!B93","v":"59. FWHG HDPL Choice Neighborhood Initiative Area"},null,null,null,null,null,null,null,null,{"$f":"'Document Checklist-Full List'!K93","v":"Provide documentation that ensures all units are or will be within a Choice Neighborhood Initiative Area."},null,null,null,null,null,null,null,null,null,null,null,null,null,null,null,null,null,"Uploaded to HCD?"]
[null,null,"Opportunity Zone Tool"]
[null,"File Name:",null,null,{"$f":"'Document Checklist-Full List'!B94","v":"60. FWHG HDPL Opportunity Zone"},null,null,null,null,null,null,null,null,{"$f":"'Document Checklist-Full List'!K94","v":"Provide a Project/Program opportunity zone map, indicate the approximate location of the Project/Program on the map."},null,null,null,null,null,null,null,null,null,null,null,null,null,null,null,null,null,"Uploaded to HCD?"]
[null,null,"Climate and Economic Justice Screening Tool"]
[null,"File Name:",null,null,{"$f":"'Document Checklist-Full List'!B95","v":"61. FWHG HDPL Justice40 Initiative"},null,null,null,null,null,null,null,null,{"$f":"'Document Checklist-Full List'!K95","v":"Provide a Project/Program disadvantaged community map, indicate the approximate location(s) of the Project/Program on the map."},null,null,null,null,null,null,null,null,null,null,null,null,null,null,null,null,null,"Uploaded to HCD?"]
[null,"Are all units to be assisted with program funds located in a High or Highest Resource Area per TCAC/HCD Opportunity Area Map available at the time of application?"]
[null,"Identify the Resource Area per TCAC/HCD Opportunity Area Map. Applicant may choose to utilize a Resource Area designation from the TCAC/HCD Opportunity Area Maps in effect when the initial site control (pursuant to §400.3) was obtained, if a TCAC/HCD Opportunity Area Map exists for that year.",null,null,null,null,null,null,null,null,null,null,null,null,null,null,null,null,null,null,null,null,null,null,null,null,null,null,null,null,null,null,"https://www.treasurer.ca.gov/ctcac/opportunity.asp"]
[null,"Enter the entire TCAC/HCD Opportunity Area Map Tract ID #:",null,null,null,null,null,null,null,null,null,null,null,null,null,null,null,null,null,null,null,null,"Opportunity Area Map Category: "]
[null,"File Name:",null,null,{"$f":"'Document Checklist-Full List'!$B$31","v":"05. Opportunity Area "},null,null,null,null,null,null,null,null,{"$f":"'Document Checklist-Full List'!$K$31","v":"Documentation of TCAC/HCD Opportunity Area status either (1) at time of application, or (2) when initial site control (pursuant to §400.3) was obtained, if a TCAC/HCD Opportunity Area Map exists for that year."},null,null,null,null,null,null,null,null,null,null,null,null,null,null,null,null,null,"Uploaded to HCD?"]
[]
[null,null,"CalHome \"Self-Help Technical Assistance Grants only\" Are all Units, or will all Units be located within a federal Promise Zone, a Choice Neighborhood Initiative Area, an Opportunity Zone, or a federally designated Justice40 Initiative disadvantaged community?"]
[null,null,"Select from dropdown menu:"]
[]
[]
[]
[null,null,"Federal Promise Zone Tool"]
[null,"File Name:",null,null,{"$f":"'Document Checklist-Full List'!B96","v":"62. CalHome SHTA Federal Promise Zone"},null,null,null,null,null,null,null,null,{"$f":"'Document Checklist-Full List'!K96","v":"Provide a Project/Program area map, indicate the approximate location of the Project/Program on the map."},null,null,null,null,null,null,null,null,null,null,null,null,null,null,null,null,null,"Uploaded to HCD?"]
[null,"File Name:",null,null,{"$f":"'Document Checklist-Full List'!B97","v":"63. CalHome SHTA Choice Neighborhood Initiative Area"},null,null,null,null,null,null,null,null,{"$f":"'Document Checklist-Full List'!K97","v":"Provide documentation that ensures all units are or will be within a Choice Neighborhood Initiative Area."},null,null,null,null,null,null,null,null,null,null,null,null,null,null,null,null,null,"Uploaded to HCD?"]
[null,null,"Opportunity Zone Tool"]
[null,"File Name:",null,null,{"$f":"'Document Checklist-Full List'!B98","v":"64. CalHome SHTA Opportunity Zone"},null,null,null,null,null,null,null,null,{"$f":"'Document Checklist-Full List'!K98","v":"Provide a Project/Program opportunity zone map, indicate the approximate location of the Project/Program on the map."},null,null,null,null,null,null,null,null,null,null,null,null,null,null,null,null,null,"Uploaded to HCD?"]
[null,null,"Climate and Economic Justice Screening Tool"]
[null,"File Name:",null,null,{"$f":"'Document Checklist-Full List'!B99","v":"65. CalHome SHTA Justice40 Initiative"},null,null,null,null,null,null,null,null,{"$f":"'Document Checklist-Full List'!K99","v":"Provide a Project/Program disadvantaged community map, indicate the approximate location(s) of the Project/Program on the map."},null,null,null,null,null,null,null,null,null,null,null,null,null,null,null,null,null,"Uploaded to HCD?"]
[null,"Will all units to be assisted with program funds located in a High or Highest Resource Area per ",null,null,null,null,null,null,null,null,null,null,null,null,null,null,null,null,null,null,null,null,null,"TCAC/HCD Opportunity Area Map?",null,null,null,null,null,"at the time of application?"]
[null,"Enter the entire TCAC/HCD Opportunity Area Map Tract ID #:",null,null,null,null,null,null,null,null,null,null,null,null,null,null,null,null,null,null,null,null,"Opportunity Area Map Category: "]
[null,"Enter the entire TCAC/HCD Opportunity Area Map Tract ID #:",null,null,null,null,null,null,null,null,null,null,null,null,null,null,null,null,null,null,null,null,"Opportunity Area Map Category: "]
[null,"Enter the entire TCAC/HCD Opportunity Area Map Tract ID #:",null,null,null,null,null,null,null,null,null,null,null,null,null,null,null,null,null,null,null,null,"Opportunity Area Map Category: "]
[null,"Enter the entire TCAC/HCD Opportunity Area Map Tract ID #:",null,null,null,null,null,null,null,null,null,null,null,null,null,null,null,null,null,null,null,null,"Opportunity Area Map Category: "]
[null,"Enter the entire TCAC/HCD Opportunity Area Map Tract ID #:",null,null,null,null,null,null,null,null,null,null,null,null,null,null,null,null,null,null,null,null,"Opportunity Area Map Category: "]
[]
[null,null,"FWHG \"Self-Help Technical Assistance Grants only\" Are all Units, or will all Units be located within a federal Promise Zone, a Choice Neighborhood Initiative Area, an Opportunity Zone, or a federally designated Justice40 Initiative disadvantaged community?"]
[null,null,"Select from dropdown menu:"]
[]
[]
[]
[null,null,"Federal Promise Zone Tool"]
[null,"File Name:",null,null,{"$f":"'Document Checklist-Full List'!B100","v":"66. FWHG SHTA Federal Promise Zone"},null,null,null,null,null,null,null,null,{"$f":"'Document Checklist-Full List'!K100","v":"Provide a Project/Program area map, indicate the approximate location of the Project/Program on the map."},null,null,null,null,null,null,null,null,null,null,null,null,null,null,null,null,null,"Uploaded to HCD?"]
[null,"File Name:",null,null,{"$f":"'Document Checklist-Full List'!B101","v":"67. FWHG SHTA Choice Neighborhood Initiative Area"},null,null,null,null,null,null,null,null,{"$f":"'Document Checklist-Full List'!K101","v":"Provide documentation that ensures all units are or will be within a Choice Neighborhood Initiative Area."},null,null,null,null,null,null,null,null,null,null,null,null,null,null,null,null,null,"Uploaded to HCD?"]
[null,null,"Opportunity Zone Tool"]
[null,"File Name:",null,null,{"$f":"'Document Checklist-Full List'!B102","v":"68. FWHG SHTA Opportunity Zone"},null,null,null,null,null,null,null,null,{"$f":"'Document Checklist-Full List'!K102","v":"Provide a Project/Program opportunity zone map, indicate the approximate location of the Project/Program on the map."},null,null,null,null,null,null,null,null,null,null,null,null,null,null,null,null,null,"Uploaded to HCD?"]
[null,null,"Climate and Economic Justice Screening Tool"]
[null,"File Name:",null,null,{"$f":"'Document Checklist-Full List'!B103","v":"69. FWHG SHTA Justice40 Initiative"},null,null,null,null,null,null,null,null,{"$f":"'Document Checklist-Full List'!K103","v":"Provide a Project/Program disadvantaged community map, indicate the approximate location(s) of the Project/Program on the map."},null,null,null,null,null,null,null,null,null,null,null,null,null,null,null,null,null,"Uploaded to HCD?"]
[null,"Will all units to be assisted with program funds located in a High or Highest Resource Area per ",null,null,null,null,null,null,null,null,null,null,null,null,null,null,null,null,null,null,null,null,null,"TCAC/HCD Opportunity Area Map?",null,null,null,null,null,"at the time of application?"]
[null,"Enter the entire TCAC/HCD Opportunity Area Map Tract ID #:",null,null,null,null,null,null,null,null,null,null,null,null,null,null,null,null,null,null,null,null,"Opportunity Area Map Category: "]
[null,"Enter the entire TCAC/HCD Opportunity Area Map Tract ID #:",null,null,null,null,null,null,null,null,null,null,null,null,null,null,null,null,null,null,null,null,"Opportunity Area Map Category: "]
[null,"Enter the entire TCAC/HCD Opportunity Area Map Tract ID #:",null,null,null,null,null,null,null,null,null,null,null,null,null,null,null,null,null,null,null,null,"Opportunity Area Map Category: "]
[null,"Enter the entire TCAC/HCD Opportunity Area Map Tract ID #:",null,null,null,null,null,null,null,null,null,null,null,null,null,null,null,null,null,null,null,null,"Opportunity Area Map Category: "]
[null,"Enter the entire TCAC/HCD Opportunity Area Map Tract ID #:",null,null,null,null,null,null,null,null,null,null,null,null,null,null,null,null,null,null,null,null,"Opportunity Area Map Category: "]
[]
[null,null,"CalHome \"Mortgage Assistance Grants only\" Are all Units, or will all Units be located within a federal Promise Zone, a Choice Neighborhood Initiative Area, an Opportunity Zone, or a federally designated Justice40 Initiative disadvantaged community?"]
[null,null,"Select from dropdown menu:"]
[]
[]
[]
[null,null,"Federal Promise Zone Tool"]
[null,"File Name:",null,null,{"$f":"'Document Checklist-Full List'!B104","v":"70. CalHome MA Federal Promise Zone"},null,null,null,null,null,null,null,null,{"$f":"'Document Checklist-Full List'!K104","v":"Provide a Project/Program area map, indicate the approximate location of the Project/Program on the map."},null,null,null,null,null,null,null,null,null,null,null,null,null,null,null,null,null,"Uploaded to HCD?"]
[null,"File Name:",null,null,{"$f":"'Document Checklist-Full List'!B105","v":"71. CalHome MA Choice Neighborhood Initiative Area"},null,null,null,null,null,null,null,null,{"$f":"'Document Checklist-Full List'!K105","v":"Provide documentation that ensures all units are or will be within a Choice Neighborhood Initiative Area."},null,null,null,null,null,null,null,null,null,null,null,null,null,null,null,null,null,"Uploaded to HCD?"]
[null,null,"Opportunity Zone Tool"]
[null,"File Name:",null,null,{"$f":"'Document Checklist-Full List'!B106","v":"72. CalHome MA Opportunity Zone"},null,null,null,null,null,null,null,null,{"$f":"'Document Checklist-Full List'!K106","v":"Provide a Project/Program opportunity zone map, indicate the approximate location of the Project/Program on the map."},null,null,null,null,null,null,null,null,null,null,null,null,null,null,null,null,null,"Uploaded to HCD?"]
[null,null,"Climate and Economic Justice Screening Tool"]
[null,"File Name:",null,null,{"$f":"'Document Checklist-Full List'!B107","v":"73. CalHome MA Justice40 Initiative"},null,null,null,null,null,null,null,null,{"$f":"'Document Checklist-Full List'!K107","v":"Provide a Project/Program disadvantaged community map, indicate the approximate location(s) of the Project/Program on the map."},null,null,null,null,null,null,null,null,null,null,null,null,null,null,null,null,null,"Uploaded to HCD?"]
[null,"Will all units to be assisted with program funds located in a High or Highest Resource Area per ",null,null,null,null,null,null,null,null,null,null,null,null,null,null,null,null,null,null,null,null,null,"TCAC/HCD Opportunity Area Map?",null,null,null,null,null,"at the time of application?"]
[null,"Enter the entire TCAC/HCD Opportunity Area Map Tract ID #:",null,null,null,null,null,null,null,null,null,null,null,null,null,null,null,null,null,null,null,null,"Opportunity Area Map Category: "]
[null,"Enter the entire TCAC/HCD Opportunity Area Map Tract ID #:",null,null,null,null,null,null,null,null,null,null,null,null,null,null,null,null,null,null,null,null,"Opportunity Area Map Category: "]
[null,"Enter the entire TCAC/HCD Opportunity Area Map Tract ID #:",null,null,null,null,null,null,null,null,null,null,null,null,null,null,null,null,null,null,null,null,"Opportunity Area Map Category: "]
[null,"Enter the entire TCAC/HCD Opportunity Area Map Tract ID #:",null,null,null,null,null,null,null,null,null,null,null,null,null,null,null,null,null,null,null,null,"Opportunity Area Map Category: "]
[null,"Enter the entire TCAC/HCD Opportunity Area Map Tract ID #:",null,null,null,null,null,null,null,null,null,null,null,null,null,null,null,null,null,null,null,null,"Opportunity Area Map Category: "]
[]
[null,null,"FWHG \"Mortgage Assistance Grants only\" Are all Units, or will all Units be located within a federal Promise Zone, a Choice Neighborhood Initiative Area, an Opportunity Zone, or a federally designated Justice40 Initiative disadvantaged community?"]
[null,null,"Select from dropdown menu:"]
[]
[]
[]
[null,null,"Federal Promise Zone Tool"]
[null,"File Name:",null,null,{"$f":"'Document Checklist-Full List'!B108","v":"74. FWHG MA Federal Promise Zone"},null,null,null,null,null,null,null,null,{"$f":"'Document Checklist-Full List'!K108","v":"Provide a Project/Program area map, indicate the approximate location of the Project/Program on the map."},null,null,null,null,null,null,null,null,null,null,null,null,null,null,null,null,null,"Uploaded to HCD?"]
[null,"File Name:",null,null,{"$f":"'Document Checklist-Full List'!B109","v":"75. FWHG MA Choice Neighborhood Initiative Area"},null,null,null,null,null,null,null,null,{"$f":"'Document Checklist-Full List'!K109","v":"Provide documentation that ensures all units are or will be within a Choice Neighborhood Initiative Area."},null,null,null,null,null,null,null,null,null,null,null,null,null,null,null,null,null,"Uploaded to HCD?"]
[null,null,"Opportunity Zone Tool"]
[null,"File Name:",null,null,{"$f":"'Document Checklist-Full List'!B110","v":"76. FWHG MA Opportunity Zone"},null,null,null,null,null,null,null,null,{"$f":"'Document Checklist-Full List'!K110","v":"Provide a Project/Program opportunity zone map, indicate the approximate location of the Project/Program on the map."},null,null,null,null,null,null,null,null,null,null,null,null,null,null,null,null,null,"Uploaded to HCD?"]
[null,null,"Climate and Economic Justice Screening Tool"]
[null,"File Name:",null,null,{"$f":"'Document Checklist-Full List'!B111","v":"77. FWHG MA Justice40 Initiative"},null,null,null,null,null,null,null,null,{"$f":"'Document Checklist-Full List'!K111","v":"Provide a Project/Program disadvantaged community map, indicate the approximate location(s) of the Project/Program on the map."},null,null,null,null,null,null,null,null,null,null,null,null,null,null,null,null,null,"Uploaded to HCD?"]
[null,"Will all units to be assisted with program funds located in a High or Highest Resource Area per ",null,null,null,null,null,null,null,null,null,null,null,null,null,null,null,null,null,null,null,null,null,"TCAC/HCD Opportunity Area Map?",null,null,null,null,null,"at the time of application?"]
[null,"Enter the entire TCAC/HCD Opportunity Area Map Tract ID #:",null,null,null,null,null,null,null,null,null,null,null,null,null,null,null,null,null,null,null,null,"Opportunity Area Map Category: "]
[null,"Enter the entire TCAC/HCD Opportunity Area Map Tract ID #:",null,null,null,null,null,null,null,null,null,null,null,null,null,null,null,null,null,null,null,null,"Opportunity Area Map Category: "]
[null,"Enter the entire TCAC/HCD Opportunity Area Map Tract ID #:",null,null,null,null,null,null,null,null,null,null,null,null,null,null,null,null,null,null,null,null,"Opportunity Area Map Category: "]
[null,"Enter the entire TCAC/HCD Opportunity Area Map Tract ID #:",null,null,null,null,null,null,null,null,null,null,null,null,null,null,null,null,null,null,null,null,"Opportunity Area Map Category: "]
[null,"Enter the entire TCAC/HCD Opportunity Area Map Tract ID #:",null,null,null,null,null,null,null,null,null,null,null,null,null,null,null,null,null,null,null,null,"Opportunity Area Map Category: "]
[]
[null,null,"CalHome \"Owner-Occupied Rehabilitation Grants only\" Are all Units, or will all Units be located within a federal Promise Zone, a Choice Neighborhood Initiative Area, an Opportunity Zone, or a federally designated Justice40 Initiative disadvantaged community?"]
[null,null,"Select from dropdown menu:"]
[]
[]
[]
[null,null,"Federal Promise Zone Tool"]
[null,"File Name:",null,null,{"$f":"'Document Checklist-Full List'!B112","v":"78. CalHome OOR Federal Promise Zone"},null,null,null,null,null,null,null,null,{"$f":"'Document Checklist-Full List'!K112","v":"Provide a Project/Program area map, indicate the approximate location of the Project/Program on the map."},null,null,null,null,null,null,null,null,null,null,null,null,null,null,null,null,null,"Uploaded to HCD?"]
[null,"File Name:",null,null,{"$f":"'Document Checklist-Full List'!B113","v":"79. CalHome OOR Choice Neighborhood Initiative Area"},null,null,null,null,null,null,null,null,{"$f":"'Document Checklist-Full List'!K113","v":"Provide documentation that ensures all units are or will be within a Choice Neighborhood Initiative Area."},null,null,null,null,null,null,null,null,null,null,null,null,null,null,null,null,null,"Uploaded to HCD?"]
[null,null,"Opportunity Zone Tool"]
[null,"File Name:",null,null,{"$f":"'Document Checklist-Full List'!B114","v":"80. CalHome OOR Opportunity Zone"},null,null,null,null,null,null,null,null,{"$f":"'Document Checklist-Full List'!K114","v":"Provide a Project/Program opportunity zone map, indicate the approximate location of the Project/Program on the map."},null,null,null,null,null,null,null,null,null,null,null,null,null,null,null,null,null,"Uploaded to HCD?"]
[null,null,"Climate and Economic Justice Screening Tool"]
[null,"File Name:",null,null,{"$f":"'Document Checklist-Full List'!B115","v":"81. CalHome OOR Justice40 Initiative"},null,null,null,null,null,null,null,null,{"$f":"'Document Checklist-Full List'!K115","v":"Provide a Project/Program disadvantaged community map, indicate the approximate location(s) of the Project/Program on the map."},null,null,null,null,null,null,null,null,null,null,null,null,null,null,null,null,null,"Uploaded to HCD?"]
[null,"Will all units to be assisted with program funds located in a High or Highest Resource Area per ",null,null,null,null,null,null,null,null,null,null,null,null,null,null,null,null,null,null,null,null,null,"TCAC/HCD Opportunity Area Map?",null,null,null,null,null,"at the time of application?"]
[null,"Enter the entire TCAC/HCD Opportunity Area Map Tract ID #:",null,null,null,null,null,null,null,null,null,null,null,null,null,null,null,null,null,null,null,null,"Opportunity Area Map Category: "]
[null,"Enter the entire TCAC/HCD Opportunity Area Map Tract ID #:",null,null,null,null,null,null,null,null,null,null,null,null,null,null,null,null,null,null,null,null,"Opportunity Area Map Category: "]
[null,"Enter the entire TCAC/HCD Opportunity Area Map Tract ID #:",null,null,null,null,null,null,null,null,null,null,null,null,null,null,null,null,null,null,null,null,"Opportunity Area Map Category: "]
[null,"Enter the entire TCAC/HCD Opportunity Area Map Tract ID #:",null,null,null,null,null,null,null,null,null,null,null,null,null,null,null,null,null,null,null,null,"Opportunity Area Map Category: "]
[null,"Enter the entire TCAC/HCD Opportunity Area Map Tract ID #:",null,null,null,null,null,null,null,null,null,null,null,null,null,null,null,null,null,null,null,null,"Opportunity Area Map Category: "]
[]
[null,null,"FWHG \"Owner-Occupied Rehabilitation Grants only\" Are all Units, or will all Units be located within a federal Promise Zone, a Choice Neighborhood Initiative Area, an Opportunity Zone, or a federally designated Justice40 Initiative disadvantaged community?"]
[null,null,"Select from dropdown menu:"]
[]
[]
[]
[null,null,"Federal Promise Zone Tool"]
[null,"File Name:",null,null,{"$f":"'Document Checklist-Full List'!B116","v":"82. FWHG OOR Federal Promise Zone"},null,null,null,null,null,null,null,null,{"$f":"'Document Checklist-Full List'!K116","v":"Provide a Project/Program area map, indicate the approximate location of the Project/Program on the map."},null,null,null,null,null,null,null,null,null,null,null,null,null,null,null,null,null,"Uploaded to HCD?"]
[null,"File Name:",null,null,{"$f":"'Document Checklist-Full List'!B117","v":"83. FWHG OOR Choice Neighborhood Initiative Area"},null,null,null,null,null,null,null,null,{"$f":"'Document Checklist-Full List'!K117","v":"Provide documentation that ensures all units are or will be within a Choice Neighborhood Initiative Area."},null,null,null,null,null,null,null,null,null,null,null,null,null,null,null,null,null,"Uploaded to HCD?"]
[null,null,"Opportunity Zone Tool"]
[null,"File Name:",null,null,{"$f":"'Document Checklist-Full List'!B118","v":"84. FWHG OOR Opportunity Zone"},null,null,null,null,null,null,null,null,{"$f":"'Document Checklist-Full List'!K118","v":"Provide a Project/Program opportunity zone map, indicate the approximate location of the Project/Program on the map."},null,null,null,null,null,null,null,null,null,null,null,null,null,null,null,null,null,"Uploaded to HCD?"]
[null,null,"Climate and Economic Justice Screening Tool"]
[null,"File Name:",null,null,{"$f":"'Document Checklist-Full List'!B119","v":"85. FWHG OOR Justice40 Initiative"},null,null,null,null,null,null,null,null,{"$f":"'Document Checklist-Full List'!K119","v":"Provide a Project/Program disadvantaged community map, indicate the approximate location(s) of the Project/Program on the map."},null,null,null,null,null,null,null,null,null,null,null,null,null,null,null,null,null,"Uploaded to HCD?"]
[null,"Will all units to be assisted with program funds located in a High or Highest Resource Area per ",null,null,null,null,null,null,null,null,null,null,null,null,null,null,null,null,null,null,null,null,null,"TCAC/HCD Opportunity Area Map?",null,null,null,null,null,"at the time of application?"]
[null,"Enter the entire TCAC/HCD Opportunity Area Map Tract ID #:",null,null,null,null,null,null,null,null,null,null,null,null,null,null,null,null,null,null,null,null,"Opportunity Area Map Category: "]
[null,"Enter the entire TCAC/HCD Opportunity Area Map Tract ID #:",null,null,null,null,null,null,null,null,null,null,null,null,null,null,null,null,null,null,null,null,"Opportunity Area Map Category: "]
[null,"Enter the entire TCAC/HCD Opportunity Area Map Tract ID #:",null,null,null,null,null,null,null,null,null,null,null,null,null,null,null,null,null,null,null,null,"Opportunity Area Map Category: "]
[null,"Enter the entire TCAC/HCD Opportunity Area Map Tract ID #:",null,null,null,null,null,null,null,null,null,null,null,null,null,null,null,null,null,null,null,null,"Opportunity Area Map Category: "]
[null,"Enter the entire TCAC/HCD Opportunity Area Map Tract ID #:",null,null,null,null,null,null,null,null,null,null,null,null,null,null,null,null,null,null,null,null,"Opportunity Area Map Category: "]
[]
[null,null,"CalHome \"Shared Housing Grants only\" Are all Units, or will all Units be located within a federal Promise Zone, a Choice Neighborhood Initiative Area, an Opportunity Zone, or a federally designated Justice40 Initiative disadvantaged community?"]
[null,null,"Select from dropdown menu:"]
[]
[]
[]
[null,null,"Federal Promise Zone Tool"]
[null,"File Name:",null,null,{"$f":"'Document Checklist-Full List'!B120","v":"85. CalHome SH Grants Federal Promise Zone"},null,null,null,null,null,null,null,null,{"$f":"'Document Checklist-Full List'!K120","v":"Provide a Project/Program area map, indicate the approximate location of the Project/Program on the map."},null,null,null,null,null,null,null,null,null,null,null,null,null,null,null,null,null,"Uploaded to HCD?"]
[null,"File Name:",null,null,{"$f":"'Document Checklist-Full List'!B121","v":"87. CalHome SH Grants Choice Neighborhood Initiative Area"},null,null,null,null,null,null,null,null,{"$f":"'Document Checklist-Full List'!K121","v":"Provide documentation that ensures all units are or will be within a Choice Neighborhood Initiative Area."},null,null,null,null,null,null,null,null,null,null,null,null,null,null,null,null,null,"Uploaded to HCD?"]
[null,null,"Opportunity Zone Tool"]
[null,"File Name:",null,null,{"$f":"'Document Checklist-Full List'!B122","v":"88. CalHome SH Grants Opportunity Zone"},null,null,null,null,null,null,null,null,{"$f":"'Document Checklist-Full List'!K122","v":"Provide a Project/Program opportunity zone map, indicate the approximate location of the Project/Program on the map."},null,null,null,null,null,null,null,null,null,null,null,null,null,null,null,null,null,"Uploaded to HCD?"]
[null,null,"Climate and Economic Justice Screening Tool"]
[null,"File Name:",null,null,{"$f":"'Document Checklist-Full List'!B123","v":"89. CalHome SH Grants Justice40 Initiative"},null,null,null,null,null,null,null,null,{"$f":"'Document Checklist-Full List'!K123","v":"Provide a Project/Program disadvantaged community map, indicate the approximate location(s) of the Project/Program on the map."},null,null,null,null,null,null,null,null,null,null,null,null,null,null,null,null,null,"Uploaded to HCD?"]
[null,"Will all units to be assisted with program funds located in a High or Highest Resource Area per ",null,null,null,null,null,null,null,null,null,null,null,null,null,null,null,null,null,null,null,null,null,"TCAC/HCD Opportunity Area Map?",null,null,null,null,null,"at the time of application?"]
[null,"Enter the entire TCAC/HCD Opportunity Area Map Tract ID #:",null,null,null,null,null,null,null,null,null,null,null,null,null,null,null,null,null,null,null,null,"Opportunity Area Map Category: "]
[null,"Enter the entire TCAC/HCD Opportunity Area Map Tract ID #:",null,null,null,null,null,null,null,null,null,null,null,null,null,null,null,null,null,null,null,null,"Opportunity Area Map Category: "]
[null,"Enter the entire TCAC/HCD Opportunity Area Map Tract ID #:",null,null,null,null,null,null,null,null,null,null,null,null,null,null,null,null,null,null,null,null,"Opportunity Area Map Category: "]
[null,"Enter the entire TCAC/HCD Opportunity Area Map Tract ID #:",null,null,null,null,null,null,null,null,null,null,null,null,null,null,null,null,null,null,null,null,"Opportunity Area Map Category: "]
[null,"Enter the entire TCAC/HCD Opportunity Area Map Tract ID #:",null,null,null,null,null,null,null,null,null,null,null,null,null,null,null,null,null,null,null,null,"Opportunity Area Map Category: "]
[]
[null,null,"CalHome \"Accessory Dwelling Units/Junior Accessory Dwelling Units Grants only\" Are all Units, or will all Units be located within a federal Promise Zone, a Choice Neighborhood Initiative Area, an Opportunity Zone, or a federally designated Justice40 Initiative disadvantaged community?"]
[null,null,"Select from dropdown menu:"]
[]
[]
[]
[null,null,"Federal Promise Zone Tool"]
[null,"File Name:",null,null,{"$f":"'Document Checklist-Full List'!B124","v":"90. CalHome ADU-JADU Grants Federal Promise Zone"},null,null,null,null,null,null,null,null,{"$f":"'Document Checklist-Full List'!K124","v":"Provide a Project/Program area map, indicate the approximate location of the Project/Program on the map."},null,null,null,null,null,null,null,null,null,null,null,null,null,null,null,null,null,"Uploaded to HCD?"]
[null,"File Name:",null,null,{"$f":"'Document Checklist-Full List'!B125","v":"91. CalHome ADU-JADU Grants Choice Neighborhood Initiative Area"},null,null,null,null,null,null,null,null,{"$f":"'Document Checklist-Full List'!K125","v":"Provide documentation that ensures all units are or will be within a Choice Neighborhood Initiative Area."},null,null,null,null,null,null,null,null,null,null,null,null,null,null,null,null,null,"Uploaded to HCD?"]
[null,null,"Opportunity Zone Tool"]
[null,"File Name:",null,null,{"$f":"'Document Checklist-Full List'!B126","v":"92. CalHome ADU-JADU Grants Opportunity Zone"},null,null,null,null,null,null,null,null,{"$f":"'Document Checklist-Full List'!K126","v":"Provide a Project/Program opportunity zone map, indicate the approximate location of the Project/Program on the map."},null,null,null,null,null,null,null,null,null,null,null,null,null,null,null,null,null,"Uploaded to HCD?"]
[null,null,"Climate and Economic Justice Screening Tool"]
[null,"File Name:",null,null,{"$f":"'Document Checklist-Full List'!B127","v":"93. CalHome ADU-JADU Grants Justice40 Initiative"},null,null,null,null,null,null,null,null,{"$f":"'Document Checklist-Full List'!K127","v":"Provide a Project/Program disadvantaged community map, indicate the approximate location(s) of the Project/Program on the map."},null,null,null,null,null,null,null,null,null,null,null,null,null,null,null,null,null,"Uploaded to HCD?"]
[null,"Will all units to be assisted with program funds located in a High or Highest Resource Area per ",null,null,null,null,null,null,null,null,null,null,null,null,null,null,null,null,null,null,null,null,null,"TCAC/HCD Opportunity Area Map?",null,null,null,null,null,"at the time of application?"]
[null,"Enter the entire TCAC/HCD Opportunity Area Map Tract ID #:",null,null,null,null,null,null,null,null,null,null,null,null,null,null,null,null,null,null,null,null,"Opportunity Area Map Category: "]
[null,"Enter the entire TCAC/HCD Opportunity Area Map Tract ID #:",null,null,null,null,null,null,null,null,null,null,null,null,null,null,null,null,null,null,null,null,"Opportunity Area Map Category: "]
[null,"Enter the entire TCAC/HCD Opportunity Area Map Tract ID #:",null,null,null,null,null,null,null,null,null,null,null,null,null,null,null,null,null,null,null,null,"Opportunity Area Map Category: "]
[null,"Enter the entire TCAC/HCD Opportunity Area Map Tract ID #:",null,null,null,null,null,null,null,null,null,null,null,null,null,null,null,null,null,null,null,null,"Opportunity Area Map Category: "]
[null,"Enter the entire TCAC/HCD Opportunity Area Map Tract ID #:",null,null,null,null,null,null,null,null,null,null,null,null,null,null,null,null,null,null,null,null,"Opportunity Area Map Category: "]
[]
[null,null,"FWHG \"Acquisition of Manufactured Housing Grants only\" Are all Units, or will all Units be located within a federal Promise Zone, a Choice Neighborhood Initiative Area, an Opportunity Zone, or a federally designated Justice40 Initiative disadvantaged community?"]
[null,null,"Select from dropdown menu:"]
[]
[]
[]
[null,null,"Federal Promise Zone Tool"]
[null,"File Name:",null,null,{"$f":"'Document Checklist-Full List'!B128","v":"94. FWHG AMH Grants Federal Promise Zone"},null,null,null,null,null,null,null,null,{"$f":"'Document Checklist-Full List'!K128","v":"Provide a Project/Program area map, indicate the approximate location of the Project/Program on the map."},null,null,null,null,null,null,null,null,null,null,null,null,null,null,null,null,null,"Uploaded to HCD?"]
[null,"File Name:",null,null,{"$f":"'Document Checklist-Full List'!B129","v":"95. FWHG AMH Choice Neighborhood Initiative Area"},null,null,null,null,null,null,null,null,{"$f":"'Document Checklist-Full List'!K129","v":"Provide documentation that ensures all units are or will be within a Choice Neighborhood Initiative Area."},null,null,null,null,null,null,null,null,null,null,null,null,null,null,null,null,null,"Uploaded to HCD?"]
[null,null,"Opportunity Zone Tool"]
[null,"File Name:",null,null,{"$f":"'Document Checklist-Full List'!B130","v":"96. FWHG AMH Opportunity Zone"},null,null,null,null,null,null,null,null,{"$f":"'Document Checklist-Full List'!K130","v":"Provide a Project/Program opportunity zone map, indicate the approximate location of the Project/Program on the map."},null,null,null,null,null,null,null,null,null,null,null,null,null,null,null,null,null,"Uploaded to HCD?"]
[null,null,"Climate and Economic Justice Screening Tool"]
[null,"File Name:",null,null,{"$f":"'Document Checklist-Full List'!B131","v":"97. FWHG AMH Justice40 Initiative"},null,null,null,null,null,null,null,null,{"$f":"'Document Checklist-Full List'!K131","v":"Provide a Project/Program disadvantaged community map, indicate the approximate location(s) of the Project/Program on the map."},null,null,null,null,null,null,null,null,null,null,null,null,null,null,null,null,null,"Uploaded to HCD?"]
[null,"Will all units to be assisted with program funds located in a High or Highest Resource Area per ",null,null,null,null,null,null,null,null,null,null,null,null,null,null,null,null,null,null,null,null,null,"TCAC/HCD Opportunity Area Map?",null,null,null,null,null,"at the time of application?"]
[null,"Enter the entire TCAC/HCD Opportunity Area Map Tract ID #:",null,null,null,null,null,null,null,null,null,null,null,null,null,null,null,null,null,null,null,null,"Opportunity Area Map Category: "]
[null,"Enter the entire TCAC/HCD Opportunity Area Map Tract ID #:",null,null,null,null,null,null,null,null,null,null,null,null,null,null,null,null,null,null,null,null,"Opportunity Area Map Category: "]
[null,"Enter the entire TCAC/HCD Opportunity Area Map Tract ID #:",null,null,null,null,null,null,null,null,null,null,null,null,null,null,null,null,null,null,null,null,"Opportunity Area Map Category: "]
[null,"Enter the entire TCAC/HCD Opportunity Area Map Tract ID #:",null,null,null,null,null,null,null,null,null,null,null,null,null,null,null,null,null,null,null,null,"Opportunity Area Map Category: "]
[null,"Enter the entire TCAC/HCD Opportunity Area Map Tract ID #:",null,null,null,null,null,null,null,null,null,null,null,null,null,null,null,null,null,null,null,null,"Opportunity Area Map Category: "]
[]
[]
[null,null,"Community Revitalization",null,null,null,null,null,null,null,null,null,null,null,null,null,null,null,null,null,"Cal\nHome",null,null,"FWHG"]
[]
[null,null,"Homeownership Development Project Loans",null,null,null,null,null,null,null,null,null,null,null,null,null,null,null,null,null,{"$f":"IF(AND(IsCalhome,IsHDPL,vmCommunityR=\"Yes\",OR(vmDesignatedArea=\"Federal Promise Zone\",vmDesignatedArea=\"Choice Neighborhood Initiative Area\",vmDesignatedArea=\"Opportunity Zone\",vmDesignatedArea=\"Federally designated Justice40 Initiative disadvantaged community\")),10,IF(AND(OR('HOSN Scoring'!$AE$95=\"High Resource\",'HOSN Scoring'!$AE$95=\"Highest Resource\"),$AL$93=\"Yes\"),10,0))","v":0},null,null,{"$f":"IF(AND(IsJSerna,IsJHDPL,vmCommunityR2=\"Yes\",OR(vmDesignatedArea2=\"Federal Promise Zone\",vmDesignatedArea2=\"Choice Neighborhood Initiative Area\",vmDesignatedArea2=\"Opportunity Zone\",vmDesignatedArea2=\"Federally designated Justice40 Initiative disadvantaged community\")),10,IF(AND(OR('HOSN Scoring'!$AE$112=\"High Resource\",'HOSN Scoring'!$AE$112=\"Highest Resource\"),$AL$110=\"Yes\"),10,0))","v":0}]
[null,null,"Self-Help Technical Assistance Grants",null,null,null,null,null,null,null,null,null,null,null,null,null,null,null,null,null,{"$f":"IF(AND(IsCalhome,IsSHTA,vmCommunityR3=\"Yes\",OR(vmDesignatedArea3=\"Federal Promise Zone\",vmDesignatedArea3=\"Choice Neighborhood Initiative Area\",vmDesignatedArea3=\"Opportunity Zone\",vmDesignatedArea3=\"Federally designated Justice40 Initiative disadvantaged community\")),10,IF($AL$127=\"Yes\",10,0))","v":0},null,null,{"$f":"IF(AND(IsJSerna,IsJSHTA,vmCommunityR4=\"Yes\",OR(vmDesignatedArea4=\"Federal Promise Zone\",vmDesignatedArea4=\"Choice Neighborhood Initiative Area\",vmDesignatedArea4=\"Opportunity Zone\",vmDesignatedArea4=\"Federally designated Justice40 Initiative disadvantaged community\")),10,IF($AL$146=\"Yes\",10,0))","v":0}]
[null,null,"Mortgage Assistance Grants",null,null,null,null,null,null,null,null,null,null,null,null,null,null,null,null,null,{"$f":"IF(AND(IsCalhome,IsMA,vmCommunityR5=\"Yes\",OR(vmDesignatedArea5=\"Federal Promise Zone\",vmDesignatedArea5=\"Choice Neighborhood Initiative Area\",vmDesignatedArea5=\"Opportunity Zone\",vmDesignatedArea5=\"Federally designated Justice40 Initiative disadvantaged community\")),10,IF(AL165=\"Yes\",10,0))","v":0},null,null,{"$f":"IF(AND(IsJSerna,IsJMA,vmCommunityR6=\"Yes\",OR(vmDesignatedArea6=\"Federal Promise Zone\",vmDesignatedArea6=\"Choice Neighborhood Initiative Area\",vmDesignatedArea6=\"Opportunity Zone\",vmDesignatedArea6=\"Federally designated Justice40 Initiative disadvantaged community\")),10,IF($AL$184=\"Yes\",10,0))","v":0}]
[null,null,"Owner-Occupied Rehabilitation Grants",null,null,null,null,null,null,null,null,null,null,null,null,null,null,null,null,null,{"$f":"IF(AND(IsCalhome,IsOOR,vmCommunityR7=\"Yes\",OR(vmDesignatedArea7=\"Federal Promise Zone\",vmDesignatedArea7=\"Choice Neighborhood Initiative Area\",vmDesignatedArea7=\"Opportunity Zone\",vmDesignatedArea7=\"Federally designated Justice40 Initiative disadvantaged community\")),10,IF($AL$203=\"Yes\",10,0))","v":0},null,null,{"$f":"IF(AND(IsJSerna,IsJOOR,vmCommunityR8=\"Yes\",OR(vmDesignatedArea8=\"Federal Promise Zone\",vmDesignatedArea8=\"Choice Neighborhood Initiative Area\",vmDesignatedArea8=\"Opportunity Zone\",vmDesignatedArea8=\"Federally designated Justice40 Initiative disadvantaged community\")),10,IF($AL$222=\"Yes\",10,0))","v":0}]
[null,null,"Shared Housing Grants",null,null,null,null,null,null,null,null,null,null,null,null,null,null,null,null,null,{"$f":"IF(AND(IsCalhome,IsSH,vmCommunityR9=\"Yes\",OR(vmDesignatedArea9=\"Federal Promise Zone\",vmDesignatedArea9=\"Choice Neighborhood Initiative Area\",vmDesignatedArea9=\"Opportunity Zone\",vmDesignatedArea9=\"Federally designated Justice40 Initiative disadvantaged community\")),10,IF($AL$241=\"Yes\",10,0))","v":0},null,null,"N/A"]
[null,null,"Accessory Dwelling Units/Junior Accessory Dwelling Units Grants",null,null,null,null,null,null,null,null,null,null,null,null,null,null,null,null,null,{"$f":"IF(AND(IsCalhome,IsJADU,vmCommunityR10=\"Yes\",OR(vmDesignatedArea10=\"Federal Promise Zone\",vmDesignatedArea10=\"Choice Neighborhood Initiative Area\",vmDesignatedArea10=\"Opportunity Zone\",vmDesignatedArea10=\"Federally designated Justice40 Initiative disadvantaged community\")),10,IF($AL$260=\"Yes\",10,0))","v":0},null,null,"N/A"]
[null,null,"Acquisition of Manufactured Housing Grants",null,null,null,null,null,null,null,null,null,null,null,null,null,null,null,null,null,"N/A",null,null,{"$f":"IF(AND(IsJSerna,IsJAMH,vmCommunityR11=\"Yes\",OR(vmDesignatedArea11=\"Federal Promise Zone\",vmDesignatedArea11=\"Choice Neighborhood Initiative Area\",vmDesignatedArea11=\"Opportunity Zone\",vmDesignatedArea11=\"Federally designated Justice40 Initiative disadvantaged community\")),10,IF(AL279=\"Yes\",10,0))","v":0}]
[]
[]
[]
[null,null,"CalHome \"Mortgage Assistance Grants only\" For this Application, does the Applicant have housing newly constructed by the Applicant using funds other than CalHome or Serna funds, or housing newly acquired and substantially rehabilitated by the Applicant using funds other than CalHome or Serna funds for sale to first-time homebuyers?"]
[null,null,"FWHG \"Mortgage Assistance Grants only\" For this Application, does the Applicant have housing newly constructed by the Applicant using funds other than CalHome or Serna funds, or housing newly acquired and substantially rehabilitated by the Applicant using funds other than CalHome or Serna funds for sale to first-time homebuyers?"]
[null,null,"CalHome Mortgage Assistance Grants only.",null,null,null,null,null,null,"How many Volunteer Labor hours per assisted unit?"]
[null,null,null,null,null,null,null,null,null,"How many Self-Help Labor hours per assisted unit?"]
[null,null,null,null,null,null,null,null,null,"How many Youth Construction Skills Training Program hours per assisted unit (16 to 24-year-old program participants)?"]
[null,null,"FWHG Mortgage Assistance Grants only.",null,null,null,null,null,null,"How many Volunteer Labor hours per assisted unit?"]
[null,null,null,null,null,null,null,null,null,"How many Self-Help Labor hours per assisted unit?"]
[null,null,null,null,null,null,null,null,null,"How many Youth Construction Skills Training Program hours per assisted unit (16 to 24-year-old program participants)?"]
[null,null,"CalHome Self-Help Technical Assistance Grants only.",null,null,null,null,null,null,"How many Volunteer Labor hours per assisted unit?"]
[null,null,null,null,null,null,null,null,null,"How many Self-Help Labor hours per assisted unit?"]
[null,null,null,null,null,null,null,null,null,"How many Youth Construction Skills Training Program hours per assisted unit (16 to 24-year-old program participants)?"]
[null,null,"FWHG Self-Help Technical Assistance Grants only.",null,null,null,null,null,null,"How many Volunteer Labor hours per assisted unit?"]
[null,null,null,null,null,null,null,null,null,"How many Self-Help Labor hours per assisted unit?"]
[null,null,null,null,null,null,null,null,null,"How many Youth Construction Skills Training Program hours per assisted unit (16 to 24-year-old program participants)?"]
[null,null,"CalHome Homeownership Development Project Loans only.",null,null,null,null,null,null,"How many Volunteer Labor hours per assisted unit?"]
[null,null,null,null,null,null,null,null,null,"How many Self-Help Labor hours per assisted unit?"]
[null,null,null,null,null,null,null,null,null,"How many Youth Construction Skills Training Program hours per assisted unit (16 to 24-year-old program participants)?"]
[null,null,"FWHG Homeownership Development Project Loans only.",null,null,null,null,null,null,"How many Volunteer Labor hours per assisted unit?"]
[null,null,null,null,null,null,null,null,null,"How many Self-Help Labor hours per assisted unit?"]
[null,null,null,null,null,null,null,null,null,"How many Youth Construction Skills Training Program hours per assisted unit (16 to 24-year-old program participants)?"]
[]
[null,null,"Volunteer Labor, Self-Help Labor, or Youth Construction Skills Training",null,null,null,null,null,null,null,null,null,null,null,null,null,null,null,null,null,"Cal\nHome",null,null,"FWHG"]
[]
[null,null,"Homeownership Development Project Loans",null,null,null,null,null,null,null,null,null,null,null,null,null,null,null,null,null,{"$f":"IF(OR(AND(IsCalhome,IsHDPL,SUM($V$313,$V$314)>=500),$AK$315>=500),5,0)","v":0},null,null,{"$f":"IF(OR(AND(IsJSerna,IsJHDPL,SUM($V$316,$V$317)>=500),$AK$318>=500),5,0)","v":0}]
[null,null,"Self-Help Technical Assistance Grants",null,null,null,null,null,null,null,null,null,null,null,null,null,null,null,null,null,{"$f":"IF(OR(AND(IsCalhome,IsSHTA,SUM($V$307,$V$308)>=500),$AK$309>=500),5,0)","v":0},null,null,{"$f":"IF(OR(AND(IsJSerna,IsJSHTA,SUM($V$310,$V$311)>=500),$AK$312>=500),5,0)","v":0}]
[null,null,"Mortgage Assistance Grants",null,null,null,null,null,null,null,null,null,null,null,null,null,null,null,null,null,{"$f":"IF(OR(AND(IsCalhome,IsMA,$AL$299=\"Yes\",SUM($V$301,$V$302)>=500),$AK$303>=500),5,0)","v":0},null,null,{"$f":"IF(OR(AND(IsJSerna,IsJMA,$AL$300=\"Yes\",SUM($V$304,$V$305)>=500),$AK$306>=500),5,0)","v":0}]
[]
[]
[]
[null,null,"CalHome \"Mortgage Assistance Grants only\" For this Application, does the Applicant have housing newly constructed by the Applicant using funds other than CalHome or Serna funds, or housing newly acquired and substantially rehabilitated by the Applicant using funds other than CalHome or Serna funds for sale to first-time homebuyers?"]
[null,null,"Applicant can demonstrate the new development will be located on an infill site as defined in Health and Safety Code §53559(d)(3)(B). Applicants must provide a detailed map, including cross streets, showing exactly where the infill site is located."]
[null,"File Name:",null,null,{"$f":"'Document Checklist-Full List'!B132","v":"98. CalHome MA infill site"},null,null,null,null,null,null,null,null,{"$f":"'Document Checklist-Full List'!K132","v":"Applicants must provide a detailed map, including cross streets, showing exactly where the infill site is located."},null,null,null,null,null,null,null,null,null,null,null,null,null,null,null,null,null,"Uploaded to HCD?"]
[null,null,"FWHG \"Mortgage Assistance Grants only\" For this Application, does the Applicant have housing newly constructed by the Applicant using funds other than CalHome or Serna funds, or housing newly acquired and substantially rehabilitated by the Applicant using funds other than CalHome or Serna funds for sale to first-time homebuyers?"]
[null,null,"Applicant can demonstrate the new development will be located on an infill site as defined in Health and Safety Code §53559(d)(3)(B). Applicants must provide a detailed map, including cross streets, showing exactly where the infill site is located."]
[null,"File Name:",null,null,{"$f":"'Document Checklist-Full List'!B133","v":"99. FWHG MA infill site"},null,null,null,null,null,null,null,null,{"$f":"'Document Checklist-Full List'!K133","v":"Applicants must provide a detailed map, including cross streets, showing exactly where the infill site is located."},null,null,null,null,null,null,null,null,null,null,null,null,null,null,null,null,null,"Uploaded to HCD?"]
[null,null,"CalHome \"Homeownership Development Project Loans only\" Applicant can demonstrate the new development will be located on an infill site as defined in Health and Safety Code §53559(d)(3)(B). Applicants must provide a detailed map, including cross streets, showing exactly where the infill site is located."]
[null,"File Name:",null,null,{"$f":"'Document Checklist-Full List'!B134","v":"100. CalHome HDPL infill site"},null,null,null,null,null,null,null,null,{"$f":"'Document Checklist-Full List'!K134","v":"Applicants must provide a detailed map, including cross streets, showing exactly where the infill site is located."},null,null,null,null,null,null,null,null,null,null,null,null,null,null,null,null,null,"Uploaded to HCD?"]
[null,null,"FWHG \"Homeownership Development Project Loans only\" Applicant can demonstrate the new development will be located on an infill site as defined in Health and Safety Code §53559(d)(3)(B). Applicants must provide a detailed map, including cross streets, showing exactly where the infill site is located."]
[null,"File Name:",null,null,{"$f":"'Document Checklist-Full List'!B135","v":"101. FWHG HDPL infill site"},null,null,null,null,null,null,null,null,{"$f":"'Document Checklist-Full List'!K135","v":"Applicants must provide a detailed map, including cross streets, showing exactly where the infill site is located."},null,null,null,null,null,null,null,null,null,null,null,null,null,null,null,null,null,"Uploaded to HCD?"]
[null,null,"CalHome \"Self-Help Technical Assistance Grants only\" Applicant can demonstrate the new development will be located on an infill site as defined in Health and Safety Code §53559(d)(3)(B). Applicants must provide a detailed map, including cross streets, showing exactly where the infill site is located."]
[null,"File Name:",null,null,{"$f":"'Document Checklist-Full List'!B136","v":"102. CalHome SHTA infill site"},null,null,null,null,null,null,null,null,{"$f":"'Document Checklist-Full List'!K136","v":"Applicants must provide a detailed map, including cross streets, showing exactly where the infill site is located."},null,null,null,null,null,null,null,null,null,null,null,null,null,null,null,null,null,"Uploaded to HCD?"]
[null,null,"FWHG \"Self-Help Technical Assistance Grants only\" Applicant can demonstrate the new development will be located on an infill site as defined in Health and Safety Code §53559(d)(3)(B). Applicants must provide a detailed map, including cross streets, showing exactly where the infill site is located."]
[null,"File Name:",null,null,{"$f":"'Document Checklist-Full List'!B137","v":"103. FWHG SHTA infill site"},null,null,null,null,null,null,null,null,{"$f":"'Document Checklist-Full List'!K137","v":"Applicants must provide a detailed map, including cross streets, showing exactly where the infill site is located."},null,null,null,null,null,null,null,null,null,null,null,null,null,null,null,null,null,"Uploaded to HCD?"]
[null,null,"CalHome \"Accessory Dwelling Units/Junior Accessory Dwelling Units Grants only\" Applicant can demonstrate the new development will be located on an infill site as defined in Health and Safety Code §53559(d)(3)(B). Applicants must provide a detailed map, including cross streets, showing exactly where the infill site is located."]
[null,"File Name:",null,null,{"$f":"'Document Checklist-Full List'!B138","v":"104. CalHome ADU-JADU infill site"},null,null,null,null,null,null,null,null,{"$f":"'Document Checklist-Full List'!K138","v":"Applicants must provide a detailed map, including cross streets, showing exactly where the infill site is located."},null,null,null,null,null,null,null,null,null,null,null,null,null,null,null,null,null,"Uploaded to HCD?"]
[null,null,"FWHG \"Acquisition of Manufactured Housing Grants only\" Applicant can demonstrate the new development will be located on an infill site as defined in Health and Safety Code §53559(d)(3)(B). Applicants must provide a detailed map, including cross streets, showing exactly where the infill site is located."]
[null,"File Name:",null,null,{"$f":"'Document Checklist-Full List'!B139","v":"105. FWHG AMH infill site"},null,null,null,null,null,null,null,null,{"$f":"'Document Checklist-Full List'!K139","v":"Applicants must provide a detailed map, including cross streets, showing exactly where the infill site is located."},null,null,null,null,null,null,null,null,null,null,null,null,null,null,null,null,null,"Uploaded to HCD?"]
[]
[null,null,"Increases Affordable Housing Supply",null,null,null,null,null,null,null,null,null,null,null,null,null,null,null,null,null,"Cal\nHome",null,null,"FWHG"]
[]
[null,null,"Homeownership Development Project Loans",null,null,null,null,null,null,null,null,null,null,null,null,null,null,null,null,null,{"$f":"SUM(IF(AND(IsCalhome,IsHDPL),3,0),IF(IF(AND(IsCalhome,IsHDPL),3)=3,IF(vmInfillSite3=\"Yes\",2,0)))","v":0},null,null,{"$f":"SUM(IF(AND(IsJSerna,IsJHDPL),3,0),IF(IF(AND(IsJSerna,IsJHDPL),3)=3,IF(vmInfillSite4=\"Yes\",2,0)))","v":0}]
[null,null,"Self-Help Technical Assistance Grants",null,null,null,null,null,null,null,null,null,null,null,null,null,null,null,null,null,{"$f":"SUM(IF(AND(IsCalhome,IsSHTA),3,0),IF(IF(AND(IsCalhome,IsSHTA),3)=3,IF(vmInfillSite5=\"Yes\",2,0)))","v":0},null,null,{"$f":"SUM(IF(AND(IsJSerna,IsJSHTA),3,0),IF(IF(AND(IsJSerna,IsJSHTA),3)=3,IF(vmInfillSite6=\"Yes\",2,0)))","v":0}]
[null,null,"Mortgage Assistance Grants",null,null,null,null,null,null,null,null,null,null,null,null,null,null,null,null,null,{"$f":"SUM(IF(AND(IsCalhome,IsMA,$AL$328=\"Yes\"),3,0),IF(IF(AND(IsCalhome,IsMA,$AL$328=\"Yes\"),3)=3,IF(vmInfillSite=\"Yes\",2,0)))","v":0},null,null,{"$f":"SUM(IF(AND(IsJSerna,IsJMA,AL331=\"Yes\"),3,0),IF(IF(AND(IsJSerna,IsJMA,AL331=\"Yes\"),3)=3,IF(vmInfillSite2=\"Yes\",2,0)))","v":0}]
[null,null,"Accessory Dwelling Units/Junior Accessory Dwelling Units Grants",null,null,null,null,null,null,null,null,null,null,null,null,null,null,null,null,null,{"$f":"SUM(IF(AND(IsCalhome,IsJADU),3,0),IF(IF(AND(IsCalhome,IsJADU),3)=3,IF(vmInfillSite7=\"Yes\",2,0)))","v":0},null,null,"N/A"]
[null,null,"Acquisition of Manufactured Housing Grants",null,null,null,null,null,null,null,null,null,null,null,null,null,null,null,null,null,"N/A",null,null,{"$f":"SUM(IF(AND(IsJSerna,IsJAMH),3,0),IF(IF(AND(IsJSerna,IsJAMH),3)=3,IF(vmInfillSite8=\"Yes\",2,0)))","v":0}]
[]
[]
[]
[null,null,"CalHome \"Mortgage Assistance Grants only\" For this Application, does the Applicant have housing newly constructed by the Applicant using funds other than CalHome or Serna funds, or housing newly acquired and substantially rehabilitated by the Applicant using funds other than CalHome or Serna funds for sale to first-time homebuyers?"]
[null,null,"FWHG \"Mortgage Assistance Grants only\" For this Application, does the Applicant have housing newly constructed by the Applicant using funds other than CalHome or Serna funds, or housing newly acquired and substantially rehabilitated by the Applicant using funds other than CalHome or Serna funds for sale to first-time homebuyers?"]
[null,null,"Number of Prospective Households Served",null,null,null,null,null,null,null,null,null,null,null,null,null,null,null,null,null,"Cal\nHome",null,null,"FWHG"]
[]
[null,null,"Homeownership Development Project Loans",null,null,null,null,null,null,null,null,null,null,null,null,null,null,null,null,null,{"$f":"IF(IsCalhome,IF('Grant-Loan Amount'!$K$19>=25,5,IF(AND('Grant-Loan Amount'!$K$19>=20,'Grant-Loan Amount'!$K$19<=24),4,IF(AND('Grant-Loan Amount'!$K$19>=15,'Grant-Loan Amount'!$K$19<=19),3,IF(AND('Grant-Loan Amount'!$K$19>=11,'Grant-Loan Amount'!$K$19<=14),2,IF(AND('Grant-Loan Amount'!$K$19>=1,'Grant-Loan Amount'!$K$19<=10),1,0))))))","v":false},null,null,{"$f":"IF(IsJSerna,IF('Grant-Loan Amount'!$O$19>=25,5,IF(AND('Grant-Loan Amount'!$O$19>=20,'Grant-Loan Amount'!$O$19<=24),4,IF(AND('Grant-Loan Amount'!$O$19>=15,'Grant-Loan Amount'!$O$19<=19),3,IF(AND('Grant-Loan Amount'!$O$19>=11,'Grant-Loan Amount'!$O$19<=14),2,IF(AND('Grant-Loan Amount'!$O$19>=1,'Grant-Loan Amount'!$O$19<=10),1,0))))))","v":false}]
[null,null,"Self-Help Technical Assistance Grants",null,null,null,null,null,null,null,null,null,null,null,null,null,null,null,null,null,{"$f":"IF(IsCalhome,IF('Grant-Loan Amount'!$K$20>=25,5,IF(AND('Grant-Loan Amount'!$K$20>=20,'Grant-Loan Amount'!$K$20<=24),4,IF(AND('Grant-Loan Amount'!$K$20>=15,'Grant-Loan Amount'!$K$20<=19),3,IF(AND('Grant-Loan Amount'!$K$20>=11,'Grant-Loan Amount'!$K$20<=14),2,IF(AND('Grant-Loan Amount'!$K$20>=1,'Grant-Loan Amount'!$K$20<=10),1,0))))))","v":false},null,null,{"$f":"IF(IsJSerna,IF('Grant-Loan Amount'!$O$20>=25,5,IF(AND('Grant-Loan Amount'!$O$20>=20,'Grant-Loan Amount'!$O$20<=24),4,IF(AND('Grant-Loan Amount'!$O$20>=15,'Grant-Loan Amount'!$O$20<=19),3,IF(AND('Grant-Loan Amount'!$O$20>=11,'Grant-Loan Amount'!$O$20<=14),2,IF(AND('Grant-Loan Amount'!$O$20>=1,'Grant-Loan Amount'!$O$20<=10),1,0))))))","v":false},null,null,null,"CalHome",null,null,null,null,null,"FWHG"]
[null,null,"Mortgage Assistance Grants",null,null,null,null,null,null,null,null,null,null,null,null,null,null,null,null,null,{"$f":"IF(IsCalhome,IF($AL$357=\"Yes\",$AB$363,IF($AL$357=\"No\",$AE$363)))","v":false},null,null,{"$f":"IF(IsJSerna,IF($AL$358=\"Yes\",$AH$363,IF($AL$358=\"No\",$AK$363)))","v":false},null,null,null,{"$f":"IF(AND(IsCalhome,$AL$357=\"Yes\"),IF('Grant-Loan Amount'!$K$21>=25,5,IF(AND('Grant-Loan Amount'!$K$21>=20,'Grant-Loan Amount'!$K$21<=24),4,IF(AND('Grant-Loan Amount'!$K$21>=15,'Grant-Loan Amount'!$K$21<=19),3,IF(AND('Grant-Loan Amount'!$K$21>=11,'Grant-Loan Amount'!$K$21<=14),2,IF(AND('Grant-Loan Amount'!$K$21>=1,'Grant-Loan Amount'!$K$21<=10),1,0))))))","v":false},null,null,{"$f":"IF(AND(IsCalhome,$AL$357=\"No\"),IF('Grant-Loan Amount'!$S$21/250000>=25,5,IF(AND('Grant-Loan Amount'!$S$21/250000>=20,'Grant-Loan Amount'!$S$21/250000<=24),4,IF(AND('Grant-Loan Amount'!$S$21/250000>=15,'Grant-Loan Amount'!$S$21/250000<=19),3,IF(AND('Grant-Loan Amount'!$S$21/250000>=11,'Grant-Loan Amount'!$S$21/250000<=14),2,IF(AND('Grant-Loan Amount'!$S$21/250000>=1,'Grant-Loan Amount'!$S$21/250000<=10),1,0))))))","v":false},null,null,{"$f":"IF(AND(IsJSerna,$AL$358=\"Yes\"),IF('Grant-Loan Amount'!$O$21>=25,5,IF(AND('Grant-Loan Amount'!$O$21>=20,'Grant-Loan Amount'!$O$21<=24),4,IF(AND('Grant-Loan Amount'!$O$21>=15,'Grant-Loan Amount'!$O$21<=19),3,IF(AND('Grant-Loan Amount'!$O$21>=11,'Grant-Loan Amount'!$O$21<=14),2,IF(AND('Grant-Loan Amount'!$O$21>=1,'Grant-Loan Amount'!$O$21<=10),1,0))))))","v":false},null,null,{"$f":"IF(AND(IsJSerna,$AL$358=\"No\"),IF('Grant-Loan Amount'!$W$21/250000>=25,5,IF(AND('Grant-Loan Amount'!$W$21/250000>=20,'Grant-Loan Amount'!$W$21/250000<=24),4,IF(AND('Grant-Loan Amount'!$W$21/250000>=15,'Grant-Loan Amount'!$W$21/250000<=19),3,IF(AND('Grant-Loan Amount'!$W$21/250000>=11,'Grant-Loan Amount'!$W$21/250000<=14),2,IF(AND('Grant-Loan Amount'!$W$21/250000>=1,'Grant-Loan Amount'!$W$21/250000<=10),1,0))))))","v":false}]
[null,null,"Owner-Occupied Rehabilitation Grants",null,null,null,null,null,null,null,null,null,null,null,null,null,null,null,null,null,{"$f":"IF(IsCalhome,IF('Grant-Loan Amount'!$K$22>=25,5,IF(AND('Grant-Loan Amount'!$K$22>=20,'Grant-Loan Amount'!$K$22<=24),4,IF(AND('Grant-Loan Amount'!$K$22>=15,'Grant-Loan Amount'!$K$22<=19),3,IF(AND('Grant-Loan Amount'!$K$22>=11,'Grant-Loan Amount'!$K$22<=14),2,IF(AND('Grant-Loan Amount'!$K$22>=1,'Grant-Loan Amount'!$K$22<=10),1,0))))))","v":false},null,null,{"$f":"IF(IsJSerna,IF('Grant-Loan Amount'!$O$22>=25,5,IF(AND('Grant-Loan Amount'!$O$22>=20,'Grant-Loan Amount'!$O$22<=24),4,IF(AND('Grant-Loan Amount'!$O$22>=15,'Grant-Loan Amount'!$O$22<=19),3,IF(AND('Grant-Loan Amount'!$O$22>=11,'Grant-Loan Amount'!$O$22<=14),2,IF(AND('Grant-Loan Amount'!$O$22>=1,'Grant-Loan Amount'!$O$22<=10),1,0))))))","v":false}]
[null,null,"Shared Housing Grants",null,null,null,null,null,null,null,null,null,null,null,null,null,null,null,null,null,{"$f":"IF(IsCalhome,'Grant-Loan Amount'!$S$23/3000)","v":false},null,null,"N/A"]
[null,null,"Accessory Dwelling Units/Junior Accessory Dwelling Units Grants",null,null,null,null,null,null,null,null,null,null,null,null,null,null,null,null,null,{"$f":"IF(IsCalhome,IF('Grant-Loan Amount'!$K$24>=25,5,IF(AND('Grant-Loan Amount'!$K$24>=20,'Grant-Loan Amount'!$K$24<=24),4,IF(AND('Grant-Loan Amount'!$K$24>=15,'Grant-Loan Amount'!$K$24<=19),3,IF(AND('Grant-Loan Amount'!$K$24>=11,'Grant-Loan Amount'!$K$24<=14),2,IF(AND('Grant-Loan Amount'!$K$24>=1,'Grant-Loan Amount'!$K$24<=10),1,0))))))","v":false},null,null,"N/A"]
[null,null,"Acquisition of Manufactured Housing Grants",null,null,null,null,null,null,null,null,null,null,null,null,null,null,null,null,null,"N/A",null,null,{"$f":"IF(IsJSerna,IF('Grant-Loan Amount'!$O$25>=25,5,IF(AND('Grant-Loan Amount'!$O$25>=20,'Grant-Loan Amount'!$O$25<=24),4,IF(AND('Grant-Loan Amount'!$O$25>=15,'Grant-Loan Amount'!$O$25<=19),3,IF(AND('Grant-Loan Amount'!$O$25>=11,'Grant-Loan Amount'!$O$25<=14),2,IF(AND('Grant-Loan Amount'!$O$25>=1,'Grant-Loan Amount'!$O$25<=10),1,0))))))","v":false}]
[]
[]
[]
[null,null,"5 points will be awarded to Projects or Programs that are located in jurisdictions that have received a Prohousing Designation.",null,null,null,null,null,null,null,null,null,null,null,null,null,null,null,null,null,null,null,null,null,null,null,null,null,null,"Prohousing Designation"]
[null,null,"CalHome \"Homeownership Development Project Loans only\" located in a jurisdictions that has been awarded \"Prohousing Designation\"  or has applied by the application due date? If applied, points are conditional on designation within 45 days of application due date."]
[null,null,"FWHG \"Homeownership Development Project Loans only\" located in a jurisdictions that has been awarded \"Prohousing Designation\"  or has applied by the application due date? If applied, points are conditional on designation within 45 days of application due date."]
[null,null,"CalHome \"Self-Help Technical Assistance Grants only\" located in a jurisdictions that has been awarded \"Prohousing Designation\"  or has applied by the application due date? If applied, points are conditional on designation within 45 days of application due date."]
[null,null,"FWHG \"Self-Help Technical Assistance Grants only\" located in a jurisdictions that has been awarded \"Prohousing Designation\"  or has applied by the application due date? If applied, points are conditional on designation within 45 days of application due date."]
[null,null,"CalHome \"Mortgage Assistance Grants only\" located in a jurisdictions that has been awarded \"Prohousing Designation\"  or has applied by the application due date? If applied, points are conditional on designation within 45 days of application due date."]
[null,null,"FWHG \"Mortgage Assistance Grants only\" located in a jurisdictions that has been awarded \"Prohousing Designation\"  or has applied by the application due date? If applied, points are conditional on designation within 45 days of application due date."]
[null,null,"CalHome \"Owner-Occupied Rehabilitation Grants only\" located in a jurisdictions that has been awarded \"Prohousing Designation\"  or has applied by the application due date? If applied, points are conditional on designation within 45 days of application due date."]
[null,null,"FWHG \"Owner-Occupied Rehabilitation Grants only\" located in a jurisdictions that has been awarded \"Prohousing Designation\"  or has applied by the application due date? If applied, points are conditional on designation within 45 days of application due date."]
[null,null,"FWHG \"Shared Housing Grants only\" located in a jurisdictions that has been awarded \"Prohousing Designation\"  or has applied by the application due date? If applied, points are conditional on designation within 45 days of application due date."]
[null,null,"FWHG \"Accessory Dwelling Units/Junior Accessory Dwelling Units Grants only\" located in a jurisdictions that has been awarded \"Prohousing Designation\"  or has applied by the application due date? If applied, points are conditional on designation within 45 days of application due date."]
[null,null,"FWHG \"Acquisition of Manufactured Housing Grants only\" located in a jurisdictions that has been awarded \"Prohousing Designation\"  or has applied by the application due date? If applied, points are conditional on designation within 45 days of application due date."]
[]
[null,null,"Prohousing Designation",null,null,null,null,null,null,null,null,null,null,null,null,null,null,null,null,null,"Cal\nHome",null,null,"FWHG"]
[]
[null,null,"Homeownership Development Project Loans",null,null,null,null,null,null,null,null,null,null,null,null,null,null,null,null,null,{"$f":"IF(AND(IsCalhome,IsHDPL,$AL$372=\"Yes\"),5,0)","v":0},null,null,{"$f":"IF(AND(IsJSerna,IsJHDPL,$AL$373=\"Yes\"),5,0)","v":0}]
[null,null,"Self-Help Technical Assistance Grants",null,null,null,null,null,null,null,null,null,null,null,null,null,null,null,null,null,{"$f":"IF(AND(IsCalhome,IsSHTA,$AL$374=\"Yes\"),5,0)","v":0},null,null,{"$f":"IF(AND(IsJSerna,IsJSHTA,$AL$375=\"Yes\"),5,0)","v":0}]
[null,null,"Mortgage Assistance Grants",null,null,null,null,null,null,null,null,null,null,null,null,null,null,null,null,null,{"$f":"IF(AND(IsCalhome,IsMA,$AL$376=\"Yes\"),5,0)","v":0},null,null,{"$f":"IF(AND(IsJSerna,IsJMA,$AL$377=\"Yes\"),5,0)","v":0}]
[null,null,"Owner-Occupied Rehabilitation Grants",null,null,null,null,null,null,null,null,null,null,null,null,null,null,null,null,null,{"$f":"IF(AND(IsCalhome,IsOOR,$AL$378=\"Yes\"),5,0)","v":0},null,null,{"$f":"IF(AND(IsJSerna,IsJOOR,$AL$379=\"Yes\"),5,0)","v":0}]
[null,null,"Shared Housing Grants",null,null,null,null,null,null,null,null,null,null,null,null,null,null,null,null,null,{"$f":"IF(AND(IsCalhome,IsSH,$AL$380=\"Yes\"),5,0)","v":0},null,null,"N/A"]
[null,null,"Accessory Dwelling Units/Junior Accessory Dwelling Units Grants",null,null,null,null,null,null,null,null,null,null,null,null,null,null,null,null,null,{"$f":"IF(AND(IsCalhome,IsJADU,$AL$381=\"Yes\"),5,0)","v":0},null,null,"N/A"]
[null,null,"Acquisition of Manufactured Housing Grants",null,null,null,null,null,null,null,null,null,null,null,null,null,null,null,null,null,"N/A",null,null,{"$f":"IF(AND(IsJSerna,IsJAMH,$AL$382=\"Yes\"),5,0)","v":0}]
[]
[]
[]
[null,null,"Farmworker Need",null,null,null,null,null,null,null,null,null,null,null,null,null,null,null,null,null,null,null,null,"FWHG"]
[null,null,"Homeownership Development Project Loans",null,null,null,null,null,null,null,null,null,null,null,null,null,null,null,null,null,null,null,null,{"$f":"IFERROR(IF(AND(IsJSerna,IsJHDPL),VLOOKUP('Project Overview'!F108,CountyScoresTbl[],49,FALSE),0),0)","v":0}]
[null,null,"Self-Help Technical Assistance Grants",null,null,null,null,null,null,null,null,null,null,null,null,null,null,null,null,null,null,null,null,{"$f":"IFERROR(IF(AND(IsJSerna,IsJSHTA),VLOOKUP('Project Overview'!F126,CountyScoresTbl[],49,FALSE),0),0)","v":0}]
[null,null,"Mortgage Assistance Grants",null,null,null,null,null,null,null,null,null,null,null,null,null,null,null,null,null,null,null,null,{"$f":"IFERROR(IF(AND(IsJSerna,IsJMA),VLOOKUP('Project Overview'!F144,CountyScoresTbl[],49,FALSE),0),0)","v":0}]
[null,null,"Owner-Occupied Rehabilitation Grants",null,null,null,null,null,null,null,null,null,null,null,null,null,null,null,null,null,null,null,null,{"$f":"IFERROR(IF(AND(IsJSerna,IsJOOR),VLOOKUP('Project Overview'!F162,CountyScoresTbl[],49,FALSE),0),0)","v":0}]
[null,null,"Acquisition of Manufactured Housing Grants",null,null,null,null,null,null,null,null,null,null,null,null,null,null,null,null,null,null,null,null,{"$f":"IFERROR(IF(AND(IsJSerna,IsJAMH),VLOOKUP('Project Overview'!F186,CountyScoresTbl[],49,FALSE),0),0)","v":0}]
[]
[]
[]
[null,"Tiebreaker"]
[null,"In the event of tied point scores, the following tiebreakers shall be used to determine the ranking, in the order listed:"]
[null,1,"The Community Need point score"]
[null,2,"The Capability point score"]
[null,3,"The Feasibility point score"]
[null,4,"The total number units to be assisted"]
[null,5,"The award amount requested most closely matches remaining funds available"]
[null,6,"Applicant has not received a CalHome or Serna Homeownership award in the past three years"]
[]
[]
[null,"Applicant Notes/Comments"]
[]
[]
[null,"End of Document"]

{"sheet":"Tribal NOFA Scoring","index":13,"n_rows":50,"n_cols":49,"rows_kept":50,"cut":false,"hidden":true,"merged":[[44,37,44,38],[44,13,44,24],[44,1,44,12],[20,3,20,38],[10,3,10,38],[12,3,12,38],[13,4,13,38],[17,4,17,38],[18,4,18,38],[14,4,14,38],[15,4,15,38],[16,4,16,38],[22,3,22,38],[24,1,24,3],[24,4,24,12],[24,13,24,30],[3,27,3,35],[3,36,3,38],[4,1,4,38],[6,3,6,38],[8,3,8,38],[24,31,24,36],[24,37,24,38],[42,4,42,36],[35,37,35,38],[28,1,28,38],[26,1,26,38],[31,1,31,3],[31,4,31,12],[31,13,31,30],[31,31,31,36],[31,37,31,38],[37,4,37,36],[35,3,35,36],[38,37,38,38],[38,4,38,36],[46,1,46,8],[47,1,47,38],[49,1,49,38],[29,1,29,4],[29,5,29,18],[32,37,32,38],[33,1,33,3],[33,4,33,12],[33,13,33,30],[33,31,33,36],[33,37,33,38],[32,1,32,3],[32,4,32,12],[32,13,32,30],[32,31,32,36],[40,4,40,36],[3,48,4,48],[3,41,4,41],[3,42,4,42],[3,44,4,44],[3,45,4,45],[3,47,4,47]]}
[]
[]
[null,null,null,null,null,null,null,null,null,null,null,null,null,null,null,null,null,null,null,null,null,null,null,null,null,null,null,null,null,null,null,null,null,null,null,null,null,null,null,null,null,"Reviewer 1","Comments",null,"Reviewer 2","Comments",null,"Manager Review","Comments"]
[null,null,null,null,null,null,null,null,null,null,null,null,null,null,null,null,null,null,null,null,null,null,null,null,null,null,null,"Application due date:",null,null,null,null,null,null,null,null,{"$f":"Appduedate","v":"2025-02-13"},null,null,null,null,null,{"$f":"IF(OR(AP25=\"Adjust\",AP32=\"Adjust\",AP33=\"Adjust\",AP34=\"Adjust\",AP36=\"Adjust\",AP45=\"Adjust\"),\"Adjust\",\"Verified\")","v":"Verified"},null,null,{"$f":"IF(OR(AS25=\"Adjust\",AS32=\"Adjust\",AS33=\"Adjust\",AS34=\"Adjust\",AS36=\"Adjust\",AS45=\"Adjust\"),\"Adjust\",\"Verified\")","v":"Verified"},null,null,{"$f":"IF(OR(AV25=\"Adjust\",AV32=\"Adjust\",AV33=\"Adjust\",AV34=\"Adjust\",AV36=\"Adjust\",AV45=\"Adjust\"),\"Adjust\",\"Verified\")","v":"Verified"}]
[null,"§IV. Base Evaluation Criteria"]
[]
[null,null,"a.","CalHome statute (HSC §50650.4) states that “In allocating funds, the department shall utilize a competitive application process, using weighted evaluation criteria”. Each CalHome Tribal application considered for funding shall be rated using the following criteria and maximum possible rating points:"]
[]
[null,null,null,"Provide a Community Need Narrative describing the need in Applicant’s tribal community for the CalHome activity/activities for which Applicant is applying. "]
[]
[null,null,null,"The Applicant shall define their tribal community in the narrative. The Applicant’s tribal community may be defined using geographic characteristics (e.g. the boundaries of a rancheria or reservation or county limits), population characteristics (e.g. tribal members or American Indian and Alaskan Native (AIAN) households) and/or other characteristics."]
[]
[null,null,null,"Examples of information that could be included in the Community Need Narrative include but are not limited to:"]
[null,null,null,{"$f":"CHAR(149)","v":"•"},"Housing cost burden among the tribal community"]
[null,null,null,"•","Homelessness among the tribal community"]
[null,null,null,"•","Household income levels among the tribal community"]
[null,null,null,"•","Housing overcrowding among the tribal community"]
[null,null,null,"•","Shortage of affordable housing units compared to household incomes in the tribal community"]
[null,null,null,"•","Physical condition of existing housing stock in the tribal community"]
[]
[null,null,null,"The narrative should be written by someone who is familiar with tribal data and can do an adequate analysis that demonstrates the need."]
[]
[null,null,null,"All applications that provide a Community Need Narrative will receive full points for this criterion - 25 Maximum Points"]
[]
[null,"File Name:",null,null,{"$f":"'Document Checklist-Full List'!B142","v":"106. Community Need Narrative"},null,null,null,null,null,null,null,null,{"$f":"'Document Checklist-Full List'!K142","v":"Provide a Community Need Narrative describing the need in Applicant’s tribal community for the CalHome activity/activities for which Applicant is applying. "},null,null,null,null,null,null,null,null,null,null,null,null,null,null,null,null,null,"Uploaded to HCD?"]
[]
[null,"Community Revitalization - A Program or Project will be considered to contribute towards Community Revitalization if all Units to be assisted with Program funds are, or will be, located within a federal Promise Zone, a Choice Neighborhood Initiative Area, an Opportunity Zone, or a federally designated Justice40 Initiative disadvantaged community."]
[]
[null,"Contributes to Community Revitalization as defined in Appendix A of the Guidelines, or all units to be assisted with program funds are, or will be, located within Indian Country, or the Applicant will provide a preference for Tribal Households. - 25 Maximum Points"]
[null,"Project Units ",null,null,null,"contributes to Community Revitalization as defined above"]
[]
[null,"File Name:",null,null,{"$f":"'Document Checklist-Full List'!B143","v":"107. Community Revitalization"},null,null,null,null,null,null,null,null,{"$f":"'Document Checklist-Full List'!K143","v":"Provide documentation that ensures all Units to be assisted with Program funds are, or will be, located within a federal Promise Zone, a Choice Neighborhood Initiative Area, an Opportunity Zone, or a federally designated Justice40 Initiative disadvantaged community."},null,null,null,null,null,null,null,null,null,null,null,null,null,null,null,null,null,"Uploaded to HCD?"]
[null,"File Name:",null,null,{"$f":"'Document Checklist-Full List'!B144","v":"108. Preference efforts"},null,null,null,null,null,null,null,null,{"$f":"'Document Checklist-Full List'!K144","v":"Provide a letter explaining the efforts to be made to provide preference to Tribal Households."},null,null,null,null,null,null,null,null,null,null,null,null,null,null,null,null,null,"Uploaded to HCD?",null,null,null,null,null,null,null,null,null,"Verified",null,null,"Verified",null,null,"Verified"]
[null,"File Name:",null,null,{"$f":"'Document Checklist-Full List'!B145","v":"109. Indian Country Verification"},null,null,null,null,null,null,null,null,{"$f":"'Document Checklist-Full List'!K145","v":"Documentation verifying land is located in Indian Country as defined by 18 USC 1151."},null,null,null,null,null,null,null,null,null,null,null,null,null,null,null,null,null,"Uploaded to HCD?",null,null,null,null,null,null,null,null,null,"Verified",null,null,"Verified",null,null,"Verified"]
[]
[null,null,"b.","The Applicant acknowledges that in the event of a tie point score, the following will be used as tiebreakers:"]
[]
[null,null,null,"1.","The Applicant has not received a CalHome award before."]
[null,null,null,null,"Does the Applicant/Recipient have previous loans and/or grants from the CalHome Program?",null,null,null,null,null,null,null,null,null,null,null,null,null,null,null,null,null,null,null,null,null,null,null,null,null,null,null,null,null,null,null,null,{"$f":"IF(vmCRE=\"\",\"\",vmCRE)","v":""}]
[]
[null,null,null,"2.","The date the Application was received, with the application received earlier getting preference."]
[]
[null,null,null,"3.","The award amount requested most closely matches remaining funds available and fully expends available funds. The Applicant may receive a partial award."]
[]
[null,"§II (c)(2)(I) Applicant acknowledges and understand",null,null,null,null,null,null,null,null,null,null,null,"Negative Points and Disencumbrance Policies?"]
[]
[null,"Applicant Notes/Comments"]
[]
[]
[null,"End of Document"]

{"sheet":"Entity Org Docs","index":14,"n_rows":22,"n_cols":2,"rows_kept":22,"cut":false,"hidden":true,"merged":[[14,1,14,38],[5,1,5,38],[8,1,8,38],[11,1,11,38],[1,39,1,40],[4,1,4,38],[1,1,1,38],[21,1,21,38],[6,1,6,38],[3,1,3,38],[18,1,18,38],[19,1,19,38],[17,1,17,38],[16,1,16,38],[7,1,7,38],[12,1,12,38],[9,1,9,38],[10,1,10,38],[13,1,13,38],[15,1,15,38]]}
[]
[null,"Entity Organizational Documents"]
[]
[null,"Organizational Documents"]
[null,"The following is intended as a brief summary of legal documents commonly required to verify the legal authority of the private entity or entities applying to HCD for an Award of funds and does not apply to public Applicant. Documents required to apply for funds (threshold requirements) are legally distinct from those required to enter into a standard agreement or to receive bonus points. For projects receiving an Award of HCD funds, additional documents, or corrections, may be required prior to execution of the Standard Agreement."]
[]
[null,"Organizational Charts"]
[null,"Complete organizational charts are required for the Recipient."]
[]
[null,"Corporate Entities"]
[null,"Articles of Incorporation (Corp. Code §154, 200 and 202) as certified by the CA Secretary of State.\nBylaws and any amendments thereto (Corp. Code §207(b), 211 and 212).\nCertificate of Amendment of Articles of Incorporation (Corp. Code §900-910 (general stock), §5810-5820 (public benefit and religious corporations), §7810-7820 (mutual benefit corporations), or §12500-12510 (general cooperative corporations)) as applicable.\nRestated Articles of Incorporation (Corp. Code §901, 906, 910 (general stock), §5811, 5815, 5819 (public benefit and religious corporations), §7811, 7815 and 7819 (mutual benefit corporations) and §12501, 12506 and 12510 (general cooperative corporations)) as applicable.\nStatement of Information (CA Secretary of State form SI-100 or SI-200).\nShareholder Agreements (Corp. Code §186) if applicable.\nCertificate of Good Standing certified by Secretary of State. Certificate of Good Standing must be dated 30 days or less from the application due date."]
[]
[null,"Limited Liability Companies "]
[null,"Articles of Organization (CA Secretary of State form LLC-1).\nCertificate of Amendment (CA Secretary of State form LLC-2) if applicable.\nRestated Articles of Organization (CA Secretary of State form LLC-10) if applicable.\nCertificate of Correction (CA Secretary of State form LLC-11) if applicable.\nStatement of Information (CA Secretary of State form LLC-12 or LLC-12NC).\nOperating Agreement (Corp. Code §17707.02(s) and 17701.10).\nCertificate of Good Standing certified by Secretary of State. Certificate of Good Standing must be dated 30 days or less from the application due date."]
[]
[null,"Limited Partnerships"]
[null,"Certificate of Limited Partnership (CA Secretary of State form LP-1).\nAmendment to Certificate of Limited Partnership (CA Secretary of State form LP-2) if applicable.\nCertificate of Correction (CA Secretary of State form LP-2) if applicable.\nLimited Partnership Agreement (CA Corp. Code §15901.02(x) and 15901.10).\nAmended and Restated Limited Partnership Agreement.\nCertificate of Good Standing certified by Secretary of State."]
[]
[null,"Tribal Entity"]
[null,"Tribe Formation Documents (Constitution, Charters, etc.).\nFederal Register of Indian Entities Recognized (81 Fed Reg. 26826) if applicable.\nBIA Federal Acknowledgment Petitioner List (CFR Section 83.1 of Title 25) if applicable.\nContact List maintained by the Native American Heritage Commission (GC Section 65352.3) if applicable."]
[]
[null,"End of Document"]

{"sheet":"Document Checklist-Full List","index":15,"n_rows":149,"n_cols":38,"rows_kept":149,"cut":false,"hidden":true,"merged":[[59,1,59,9],[59,10,59,27],[59,28,59,33],[59,34,59,35],[60,1,60,9],[60,10,60,27],[60,28,60,33],[60,34,60,35],[147,10,147,27],[90,10,90,27],[90,28,90,33],[90,34,90,35],[82,1,82,9],[82,10,82,27],[82,28,82,33],[82,34,82,35],[84,1,84,9],[84,10,84,27],[84,28,84,33],[84,34,84,35],[86,1,86,9],[87,10,87,27],[87,28,87,33],[87,34,87,35],[148,10,148,27],[147,28,147,33],[148,28,148,33],[80,1,80,9],[80,10,80,27],[80,28,80,33],[80,34,80,35],[81,1,81,9],[81,10,81,27],[81,28,81,33],[81,34,81,35],[90,1,90,9],[89,1,89,9],[89,10,89,27],[89,28,89,33],[89,34,89,35],[83,1,83,9],[83,10,83,27],[83,28,83,33],[83,34,83,35],[94,1,94,9],[94,10,94,27],[138,1,138,9],[138,10,138,27],[77,1,77,9],[77,10,77,27],[77,28,77,33],[77,34,77,35],[78,1,78,9],[78,10,78,27],[78,28,78,33],[78,34,78,35],[79,1,79,9],[79,10,79,27],[79,28,79,33],[79,34,79,35],[74,1,74,9],[74,10,74,27],[74,28,74,33],[74,34,74,35],[75,1,75,9],[75,10,75,27],[75,28,75,33],[75,34,75,35],[76,1,76,9],[76,10,76,27],[76,28,76,33],[76,34,76,35],[72,1,72,9],[72,10,72,27],[72,28,72,33],[72,34,72,35],[73,1,73,9],[73,10,73,27],[73,28,73,33],[73,34,73,35],[70,1,70,9],[71,1,71,9],[71,10,71,27],[71,28,71,33],[71,34,71,35],[67,1,67,9],[67,10,67,27],[67,28,67,33],[67,34,67,35],[68,1,68,9],[68,10,68,27],[68,28,68,33],[68,34,68,35],[65,1,65,9],[65,10,65,27],[65,28,65,33],[65,34,65,35],[66,1,66,9],[66,10,66,27],[66,28,66,33],[66,34,66,35],[63,1,63,9],[63,10,63,27],[63,28,63,33],[63,34,63,35],[64,1,64,9],[64,10,64,27],[64,28,64,33],[64,34,64,35],[61,1,61,9],[61,10,61,27],[61,28,61,33],[61,34,61,35],[62,1,62,9],[62,10,62,27],[62,28,62,33],[62,34,62,35],[57,1,57,9],[57,10,57,27],[57,28,57,33],[57,34,57,35],[58,1,58,9],[58,10,58,27],[58,28,58,33],[58,34,58,35],[51,1,51,9],[51,10,51,27],[51,28,51,33],[51,34,51,35],[56,1,56,9],[53,1,53,9],[54,1,54,9],[54,10,54,27],[54,28,54,33],[54,34,54,35],[50,1,50,9],[50,10,50,27],[50,28,50,33],[50,34,50,35],[49,1,49,9],[49,10,49,27],[49,28,49,33],[49,34,49,35],[46,1,46,9],[46,10,46,27],[46,28,46,33],[46,34,46,35],[47,1,47,9],[47,10,47,27],[47,28,47,33],[47,34,47,35],[48,1,48,9],[48,10,48,27],[48,28,48,33],[48,34,48,35],[41,1,41,9],[41,10,41,27],[41,28,41,33],[41,34,41,35],[45,1,45,9],[45,10,45,27],[45,28,45,33],[45,34,45,35],[40,1,40,9],[40,10,40,27],[40,28,40,33],[40,34,40,35],[42,1,42,9],[42,10,42,27],[42,28,42,33],[42,34,42,35],[43,1,43,9],[43,10,43,27],[43,28,43,33],[43,34,43,35],[44,1,44,9],[44,10,44,27],[44,28,44,33],[44,34,44,35],[38,1,38,9],[38,10,38,27],[38,28,38,33],[38,34,38,35],[33,34,33,35],[34,1,34,9],[34,10,34,27],[34,28,34,33],[34,34,34,35],[33,1,33,9],[33,10,33,27],[33,28,33,33],[35,1,35,9],[35,10,35,27],[35,28,35,33],[35,34,35,35],[36,1,36,9],[36,10,36,27],[36,28,36,33],[36,34,36,35],[37,1,37,9],[37,10,37,27],[37,28,37,33],[37,34,37,35],[30,1,30,9],[30,10,30,27],[30,28,30,33],[30,34,30,35],[31,1,31,9],[31,10,31,27],[31,28,31,33],[31,34,31,35],[32,1,32,9],[32,10,32,27],[32,28,32,33],[32,34,32,35],[29,1,29,9],[29,10,29,27],[29,28,29,33],[29,34,29,35],[26,1,26,9],[26,10,26,27],[26,28,26,33],[26,34,26,35],[27,1,27,9],[27,10,27,27],[27,28,27,33],[27,34,27,35],[24,1,24,9],[24,10,24,27],[24,28,24,33],[24,34,24,35],[25,1,25,9],[25,10,25,27],[25,28,25,33],[25,34,25,35],[22,1,22,9],[22,10,22,27],[22,28,22,33],[22,34,22,35],[23,1,23,9],[23,10,23,27],[23,28,23,33],[23,34,23,35],[20,34,20,35],[21,1,21,9],[21,10,21,27],[21,28,21,33],[21,34,21,35],[16,1,16,9],[16,10,16,27],[16,28,16,33],[16,34,16,35],[18,1,18,9],[18,10,18,27],[18,28,18,33],[18,34,18,35],[19,1,19,9],[19,10,19,27],[19,28,19,33],[19,34,19,35],[20,1,20,9],[20,10,20,27],[20,28,20,33],[15,1,15,9],[15,10,15,27],[15,28,15,33],[15,34,15,35],[12,1,12,9],[13,1,13,9],[13,10,13,27],[13,28,13,33],[13,34,13,35],[12,10,12,27],[12,28,12,33],[12,34,12,35],[14,1,14,9],[14,10,14,27],[14,28,14,33],[14,34,14,35],[10,34,10,35],[11,1,11,9],[11,10,11,27],[11,28,11,33],[11,34,11,35],[8,1,8,9],[8,10,8,27],[8,28,8,33],[8,34,8,35],[9,1,9,9],[9,10,9,27],[9,28,9,33],[9,34,9,35],[150,1,150,35],[148,1,148,9],[87,1,87,9],[88,1,88,9],[88,10,88,27],[88,28,88,33],[2,1,3,35],[147,34,147,35],[148,34,148,35],[147,1,147,9],[88,34,88,35],[4,10,4,27],[4,1,4,9],[4,28,4,35],[5,28,5,33],[5,34,5,35],[5,1,5,9],[5,10,5,27],[7,1,7,9],[10,1,10,9],[10,10,10,27],[10,28,10,33],[94,28,94,33],[94,34,94,35],[138,28,138,33],[138,34,138,35],[91,1,91,9],[91,10,91,27],[91,28,91,33],[91,34,91,35],[92,1,92,9],[92,10,92,27],[132,34,132,35],[132,1,132,9],[132,10,132,27],[132,28,132,33],[92,28,92,33],[92,34,92,35],[93,1,93,9],[93,10,93,27],[93,28,93,33],[93,34,93,35],[95,1,95,9],[95,10,95,27],[95,28,95,33],[95,34,95,35],[96,1,96,9],[96,10,96,27],[96,28,96,33],[96,34,96,35],[97,1,97,9],[97,10,97,27],[97,28,97,33],[97,34,97,35],[98,1,98,9],[98,10,98,27],[98,28,98,33],[98,34,98,35],[99,1,99,9],[99,10,99,27],[99,28,99,33],[99,34,99,35],[100,1,100,9],[100,10,100,27],[100,28,100,33],[100,34,100,35],[101,1,101,9],[101,10,101,27],[101,28,101,33],[101,34,101,35],[102,1,102,9],[102,10,102,27],[102,28,102,33],[102,34,102,35],[103,1,103,9],[103,10,103,27],[103,28,103,33],[103,34,103,35],[104,1,104,9],[104,10,104,27],[104,28,104,33],[104,34,104,35],[105,1,105,9],[105,10,105,27],[105,28,105,33],[105,34,105,35],[106,1,106,9],[106,10,106,27],[106,28,106,33],[106,34,106,35],[107,1,107,9],[107,10,107,27],[107,28,107,33],[107,34,107,35],[108,1,108,9],[108,10,108,27],[108,28,108,33],[108,34,108,35],[109,1,109,9],[109,10,109,27],[109,28,109,33],[109,34,109,35],[110,1,110,9],[110,10,110,27],[110,28,110,33],[110,34,110,35],[111,1,111,9],[111,10,111,27],[111,28,111,33],[111,34,111,35],[112,1,112,9],[112,10,112,27],[112,28,112,33],[112,34,112,35],[113,1,113,9],[113,10,113,27],[113,28,113,33],[113,34,113,35],[114,1,114,9],[114,10,114,27],[114,28,114,33],[114,34,114,35],[115,1,115,9],[115,10,115,27],[115,28,115,33],[115,34,115,35],[120,1,120,9],[120,10,120,27],[120,28,120,33],[120,34,120,35],[121,1,121,9],[121,10,121,27],[121,28,121,33],[121,34,121,35],[116,1,116,9],[116,10,116,27],[116,28,116,33],[116,34,116,35],[117,1,117,9],[117,10,117,27],[117,28,117,33],[117,34,117,35],[118,1,118,9],[118,10,118,27],[118,28,118,33],[118,34,118,35],[137,34,137,35],[137,28,137,33],[137,10,137,27],[137,1,137,9],[136,34,136,35],[136,28,136,33],[136,10,136,27],[136,1,136,9],[123,1,123,9],[123,10,123,27],[123,28,123,33],[123,34,123,35],[124,1,124,9],[124,10,124,27],[124,28,124,33],[124,34,124,35],[125,1,125,9],[125,10,125,27],[125,28,125,33],[125,34,125,35],[126,1,126,9],[126,10,126,27],[126,28,126,33],[126,34,126,35],[134,1,134,9],[134,10,134,27],[134,28,134,33],[134,34,134,35],[135,1,135,9],[135,10,135,27],[135,28,135,33],[135,34,135,35],[129,1,129,9],[129,10,129,27],[129,28,129,33],[129,34,129,35],[130,1,130,9],[130,10,130,27],[130,28,130,33],[130,34,130,35],[131,1,131,9],[131,10,131,27],[131,28,131,33],[131,34,131,35],[39,1,39,9],[39,10,39,27],[39,28,39,33],[39,34,39,35],[133,1,133,9],[133,10,133,27],[133,28,133,33],[133,34,133,35],[122,1,122,9],[122,10,122,27],[122,28,122,33],[122,34,122,35],[127,1,127,9],[127,10,127,27],[127,28,127,33],[127,34,127,35],[128,1,128,9],[128,10,128,27],[128,28,128,33],[128,34,128,35],[119,1,119,9],[119,10,119,27],[119,28,119,33],[119,34,119,35],[146,1,146,9],[140,1,140,9],[141,1,141,9],[141,10,141,27],[141,28,141,33],[141,34,141,35],[143,1,143,9],[143,10,143,27],[143,28,143,33],[143,34,143,35],[142,1,142,9],[142,10,142,27],[144,1,144,9],[144,10,144,27],[142,28,142,33],[142,34,142,35],[144,28,144,33],[144,34,144,35]]}
[]
[]
[null,"Complete Application Document/Upload Checklist"]
[]
[null,"Electronic File Name",null,null,null,null,null,null,null,null,"Document Description",null,null,null,null,null,null,null,null,null,null,null,null,null,null,null,null,null,null,null,null,null,null,null,null,null,"Per Application / must Include"]
[null,"01. Application",null,null,null,null,null,null,null,null,"HOSN Excel Application.",null,null,null,null,null,null,null,null,null,null,null,null,null,null,null,null,null,"Uploaded to HCD?",null,null,null,null,null,null,null,"P"]
[]
[null,"From \"Project Overview\" Sheet/tab"]
[null,"02. Certification & Legal Disclosure",null,null,null,null,null,null,null,null,"Reference: Applicant Certification Worksheet.",null,null,null,null,null,null,null,null,null,null,null,null,null,null,null,null,null,"Uploaded to HCD?",null,null,null,null,null,null,null,{"$f":"IF('Project Overview'!$AL$64=\"Yes\",\"P\",\"O\")","v":"O"}]
[null,"02. OrgDoc1, OrgDoc2, etc.",null,null,null,null,null,null,null,null,"Reference: Entity Org Docs Worksheet.",null,null,null,null,null,null,null,null,null,null,null,null,null,null,null,null,null,"Uploaded to HCD?",null,null,null,null,null,null,null,{"$f":"IF('Project Overview'!$AL$65=\"Yes\",\"P\",\"O\")","v":"O"}]
[null,"02. Organizational Chart",null,null,null,null,null,null,null,null,"Applicant Organization Chart.",null,null,null,null,null,null,null,null,null,null,null,null,null,null,null,null,null,"Uploaded to HCD?",null,null,null,null,null,null,null,{"$f":"IF('Project Overview'!$AL$66=\"Yes\",\"P\",\"O\")","v":"O"}]
[null,"02. Signature Block",null,null,null,null,null,null,null,null,"Signature Block - upload in Microsoft Word document.",null,null,null,null,null,null,null,null,null,null,null,null,null,null,null,null,null,"Uploaded to HCD?",null,null,null,null,null,null,null,{"$f":"IF('Project Overview'!$AL$67=\"Yes\",\"P\",\"O\")","v":"O"}]
[null,"02. Cert of Good Standing ",null,null,null,null,null,null,null,null,"Certificate of Good Standing dated within 30 days of the application due date.",null,null,null,null,null,null,null,null,null,null,null,null,null,null,null,null,null,"Uploaded to HCD?",null,null,null,null,null,null,null,{"$f":"IF('Project Overview'!$AL$68=\"Yes\",\"P\",\"O\")","v":"O"}]
[null,"02. Tax-Exempt Status",null,null,null,null,null,null,null,null,"Evidence of tax-exempt status from IRS and FTB for Corporations (Non-Profits Only).",null,null,null,null,null,null,null,null,null,null,null,null,null,null,null,null,null,"Uploaded to HCD?",null,null,null,null,null,null,null,{"$f":"IF('Project Overview'!$AL$69=\"Yes\",\"P\",\"O\")","v":"O"}]
[null,"02. Payee Data Record",null,null,null,null,null,null,null,null,"Completed Payee Data Record.",null,null,null,null,null,null,null,null,null,null,null,null,null,null,null,null,null,"Uploaded to HCD?",null,null,null,null,null,null,null,{"$f":"IF('Project Overview'!$AL$70=\"Yes\",\"P\",\"O\")","v":"O"}]
[null,"02. TIN Form",null,null,null,null,null,null,null,null,"Completed Government TIN form",null,null,null,null,null,null,null,null,null,null,null,null,null,null,null,null,null,"Uploaded to HCD?",null,null,null,null,null,null,null,{"$f":"IF('Project Overview'!$AL$71=\"Yes\",\"P\",\"O\")","v":"O"}]
[null,"02. Resolution",null,null,null,null,null,null,null,null,"Executed resolution on HCD provided template.",null,null,null,null,null,null,null,null,null,null,null,null,null,null,null,null,null,"Uploaded to HCD?",null,null,null,null,null,null,null,{"$f":"IF('Project Overview'!$AL$72=\"Yes\",\"P\",\"O\")","v":"O"}]
[]
[null,"03. Certification & Legal Disclosure",null,null,null,null,null,null,null,null,"Reference: Applicant Certification Worksheet.",null,null,null,null,null,null,null,null,null,null,null,null,null,null,null,null,null,"Uploaded to HCD?",null,null,null,null,null,null,null,{"$f":"IF('Project Overview'!$AL$80=\"Yes\",\"P\",\"O\")","v":"O"}]
[null,"03. OrgDoc1, OrgDoc2, etc.",null,null,null,null,null,null,null,null,"Reference: Entity Org Docs Worksheet.",null,null,null,null,null,null,null,null,null,null,null,null,null,null,null,null,null,"Uploaded to HCD?",null,null,null,null,null,null,null,{"$f":"IF('Project Overview'!$AL$81=\"Yes\",\"P\",\"O\")","v":"O"}]
[null,"03. Project Specific Organizational Chart",null,null,null,null,null,null,null,null,"Applicant Organization Chart.",null,null,null,null,null,null,null,null,null,null,null,null,null,null,null,null,null,"Uploaded to HCD?",null,null,null,null,null,null,null,{"$f":"IF('Project Overview'!$AL$82=\"Yes\",\"P\",\"O\")","v":"O"}]
[null,"03. Signature Block",null,null,null,null,null,null,null,null,"Signature Block - upload in Microsoft Word document.",null,null,null,null,null,null,null,null,null,null,null,null,null,null,null,null,null,"Uploaded to HCD?",null,null,null,null,null,null,null,{"$f":"IF('Project Overview'!$AL$83=\"Yes\",\"P\",\"O\")","v":"O"}]
[null,"03. Cert of Good Standing ",null,null,null,null,null,null,null,null,"Certificate of Good Standing dated within 30 days of the application due date.",null,null,null,null,null,null,null,null,null,null,null,null,null,null,null,null,null,"Uploaded to HCD?",null,null,null,null,null,null,null,{"$f":"IF('Project Overview'!$AL$84=\"Yes\",\"P\",\"O\")","v":"O"}]
[null,"03. Tax-Exempt Status",null,null,null,null,null,null,null,null,"Evidence of tax-exempt status from IRS and FTB for Corporations (Non-Profits Only).",null,null,null,null,null,null,null,null,null,null,null,null,null,null,null,null,null,"Uploaded to HCD?",null,null,null,null,null,null,null,{"$f":"IF('Project Overview'!$AL$85=\"Yes\",\"P\",\"O\")","v":"O"}]
[null,"03. Payee Data Record",null,null,null,null,null,null,null,null,"Completed Payee Data Record.",null,null,null,null,null,null,null,null,null,null,null,null,null,null,null,null,null,"Uploaded to HCD?",null,null,null,null,null,null,null,{"$f":"IF('Project Overview'!$AL$86=\"Yes\",\"P\",\"O\")","v":"O"}]
[null,"03. TIN Form",null,null,null,null,null,null,null,null,"Completed Government TIN form",null,null,null,null,null,null,null,null,null,null,null,null,null,null,null,null,null,"Uploaded to HCD?",null,null,null,null,null,null,null,{"$f":"IF('Project Overview'!$AL$87=\"Yes\",\"P\",\"O\")","v":"O"}]
[null,"03. Resolution",null,null,null,null,null,null,null,null,"Executed resolution on HCD provided template.",null,null,null,null,null,null,null,null,null,null,null,null,null,null,null,null,null,"Uploaded to HCD?",null,null,null,null,null,null,null,{"$f":"IF('Project Overview'!$AL$88=\"Yes\",\"P\",\"O\")","v":"O"}]
[null,"03. Limited Partnership Agreement",null,null,null,null,null,null,null,null,"Limited Partnership agreement, any Limited Liability Company operating agreement, the articles and bylaws of any Nonprofit Corporation, and any pertinent side agreements, between limited and general partners relating to the management and operation of the Limited Partnership (collectively, “organizational documents”).",null,null,null,null,null,null,null,null,null,null,null,null,null,null,null,null,null,"Uploaded to HCD?",null,null,null,null,null,null,null,{"$f":"IF('Project Overview'!$AL$89=\"Yes\",\"P\",\"O\")","v":"O"}]
[]
[null,"04. Rural Status Determination",null,null,null,null,null,null,null,null,"TCAC Method for determining rural status.",null,null,null,null,null,null,null,null,null,null,null,null,null,null,null,null,null,"Uploaded to HCD?",null,null,null,null,null,null,null,{"$f":"IF('Project Overview'!$AL$111=\"Yes\",\"P\",\"O\")","v":"O"}]
[null,"05. Opportunity Area ",null,null,null,null,null,null,null,null,"Documentation of TCAC/HCD Opportunity Area status either (1) at time of application, or (2) when initial site control (pursuant to §400.3) was obtained, if a TCAC/HCD Opportunity Area Map exists for that year.",null,null,null,null,null,null,null,null,null,null,null,null,null,null,null,null,null,"Uploaded to HCD?",null,null,null,null,null,null,null,{"$f":"IF('HOSN Scoring'!$AL$96=\"Yes\",\"P\",\"O\")","v":"O"}]
[null,"06. Tribal Entity Waiver",null,null,null,null,null,null,null,null,"Modifications or waivers as provided for in HSC Section 50406, subdivision (p) (Assembly Bill 1010 (Chapter 660, Statutes of 2019).",null,null,null,null,null,null,null,null,null,null,null,null,null,null,null,null,null,"Uploaded to HCD?",null,null,null,null,null,null,null,{"$f":"IF('Project Overview'!$AL$199=\"Yes\",\"P\",\"O\")","v":"O"}]
[null,"07. Indian Country Verification",null,null,null,null,null,null,null,null,"Documentation verifying land is located in Indian Country as defined by 18 USC 1151.",null,null,null,null,null,null,null,null,null,null,null,null,null,null,null,null,null,"Uploaded to HCD?",null,null,null,null,null,null,null,{"$f":"IF('Project Overview'!$AL$199=\"Yes\",\"P\",\"O\")","v":"O"}]
[null,"08. Fee Land Verification",null,null,null,null,null,null,null,null,"Documentation verifying land is located on Fee land.",null,null,null,null,null,null,null,null,null,null,null,null,null,null,null,null,null,"Uploaded to HCD?",null,null,null,null,null,null,null,{"$f":"IF('Project Overview'!$AL$199=\"Yes\",\"P\",\"O\")","v":"O"}]
[null,"09. CB Developer Experience",null,null,null,null,null,null,null,null,"Provide documentation of all requirements for \"Community-Based Developer\" listed in Appendix A – Defined Terms and as indicated in (a)-(f) above.",null,null,null,null,null,null,null,null,null,null,null,null,null,null,null,null,null,"Uploaded to HCD?",null,null,null,null,null,null,null,{"$f":"IF('Project Overview'!$AL$222=\"Yes\",\"P\",\"O\")","v":"O"}]
[null,"10. Nondiscrimination policy ",null,null,null,null,null,null,null,null,"Recipient, provide a copy of your adopted written nondiscrimination policy.",null,null,null,null,null,null,null,null,null,null,null,null,null,null,null,null,null,"Uploaded to HCD?",null,null,null,null,null,null,null,{"$f":"IF('Project Overview'!$AL$235=\"Yes\",\"P\",\"O\")","v":"O"}]
[null,"11. Procurement preference",null,null,null,null,null,null,null,null,"Provide a copy of the Tribal Entity Recipient’s procurement policy.",null,null,null,null,null,null,null,null,null,null,null,null,null,null,null,null,null,"Uploaded to HCD?",null,null,null,null,null,null,null,{"$f":"IF('Project Overview'!$AL$236=\"Yes\",\"P\",\"O\")","v":"O"}]
[null,"12. Education curriculum ",null,null,null,null,null,null,null,null,"Provide a copy of the \"Homebuyer Education curriculum\".",null,null,null,null,null,null,null,null,null,null,null,null,null,null,null,null,null,"Uploaded to HCD?",null,null,null,null,null,null,null,{"$f":"IF('Project Overview'!$AL$245=\"Yes\",\"P\",\"O\")","v":"O"}]
[null,"13. Loan servicing plan",null,null,null,null,null,null,null,null,"Recipients shall develop and employ a Loan servicing plan addressing the topics therein §206.",null,null,null,null,null,null,null,null,null,null,null,null,null,null,null,null,null,"Uploaded to HCD?",null,null,null,null,null,null,null,{"$f":"IF('Project Overview'!$AL$249=\"Yes\",\"P\",\"O\")","v":"O"}]
[null,"14. Reuse account plan",null,null,null,null,null,null,null,null,"Provide a copy of your reuse account plan.",null,null,null,null,null,null,null,null,null,null,null,null,null,null,null,null,null,"Uploaded to HCD?",null,null,null,null,null,null,null,{"$f":"IF('Project Overview'!$AL$257=\"Yes\",\"P\",\"O\")","v":"O"}]
[null,"15. Relocation Plan",null,null,null,null,null,null,null,null,"Submit a Relocation Plan",null,null,null,null,null,null,null,null,null,null,null,null,null,null,null,null,null,"Uploaded to HCD?",null,null,null,null,null,null,null,{"$f":"IF('Project Overview'!$AL$265=\"Yes\",\"P\",\"O\")","v":"O"}]
[null,"16. Shared Parking examination",null,null,null,null,null,null,null,null,"An examination of the feasibility of shared parking shall include, at a minimum, identification of parking facilities on contiguous properties or nearby properties that would not require users to cross a street and then consideration of the apparent availability of those facilities for shared parking. (Government Code 65863.1(i)). If not provided at Application due date, examination of the shared parking shall be submitted to the Department prior to the execution and approval of the Standard Agreement.",null,null,null,null,null,null,null,null,null,null,null,null,null,null,null,null,null,"Uploaded to HCD?",null,null,null,null,null,null,null,{"$f":"IF('Project Overview'!$AL$269=\"Yes\",\"P\",\"O\")","v":"O"}]
[null,"17. FWHG Site Control",null,null,null,null,null,null,null,null,"Documentation of site control in accordance with §400.3, including a summary explanation of site control and values for applications with multiple or non-contiguous parcels, scattered sites, lot line adjustments, phased projects, or other complex land and acquisition transactions.",null,null,null,null,null,null,null,null,null,null,null,null,null,null,null,null,null,"Uploaded to HCD?",null,null,null,null,null,null,null,{"$f":"IF('Project Overview'!$AL$302=\"Yes\",\"P\",\"O\")","v":"O"}]
[null,"18. FWHG Preliminary Title Report",null,null,null,null,null,null,null,null,"Provide a preliminary report dated within 30 days of application due date. For projects developed in Indian country, an attorney’s opinion regarding chain of title and current title status is acceptable in lieu of a title report.",null,null,null,null,null,null,null,null,null,null,null,null,null,null,null,null,null,"Uploaded to HCD?",null,null,null,null,null,null,null,{"$f":"IF('Project Overview'!$AL$303=\"Yes\",\"P\",\"O\")","v":"O"}]
[null,"19. FWHG Appraisal",null,null,null,null,null,null,null,null,"If land cost or value is included in the development budget, an appraisal report supporting the cost or value is required. ",null,null,null,null,null,null,null,null,null,null,null,null,null,null,null,null,null,"Uploaded to HCD?",null,null,null,null,null,null,null,{"$f":"IF('Project Overview'!$AL$304=\"Yes\",\"P\",\"O\")","v":"O"}]
[null,"20. Calhome Site Control",null,null,null,null,null,null,null,null,"Documentation of site control in accordance with §400.3, including a summary explanation of site control and values for applications with multiple or non-contiguous parcels, scattered sites, lot line adjustments, phased projects, or other complex land and acquisition transactions.",null,null,null,null,null,null,null,null,null,null,null,null,null,null,null,null,null,"Uploaded to HCD?",null,null,null,null,null,null,null,{"$f":"IF('Project Overview'!$AL$319=\"Yes\",\"P\",\"O\")","v":"O"}]
[null,"21. Calhome Preliminary Title Report",null,null,null,null,null,null,null,null,"Provide a preliminary report dated within 30 days of application due date. For projects developed in Indian country, an attorney’s opinion regarding chain of title and current title status is acceptable in lieu of a title report.",null,null,null,null,null,null,null,null,null,null,null,null,null,null,null,null,null,"Uploaded to HCD?",null,null,null,null,null,null,null,{"$f":"IF('Project Overview'!$AL$320=\"Yes\",\"P\",\"O\")","v":"O"}]
[null,"22. Calhome Appraisal",null,null,null,null,null,null,null,null,"If land cost or value is included in the development budget, an appraisal report supporting the cost or value is required. ",null,null,null,null,null,null,null,null,null,null,null,null,null,null,null,null,null,"Uploaded to HCD?",null,null,null,null,null,null,null,{"$f":"IF('Project Overview'!$AL$321=\"Yes\",\"P\",\"O\")","v":"O"}]
[null,"23. SHTA program guidelines",null,null,null,null,null,null,null,null,"The Recipient shall develop and employ Self-Help Technical Assistance Program guidelines submitted to and approved by the Department as addressing the topics therein  §401.3.",null,null,null,null,null,null,null,null,null,null,null,null,null,null,null,null,null,"Uploaded to HCD?",null,null,null,null,null,null,null,{"$f":"IF('Project Overview'!$AL$341=\"Yes\",\"P\",\"O\")","v":"O"}]
[null,"24. MA Program Underwriting Guidelines ",null,null,null,null,null,null,null,null,"Program Recipients shall develop and employ Mortgage Assistance Program Underwriting Guidelines that have been submitted to and approved by the Department.",null,null,null,null,null,null,null,null,null,null,null,null,null,null,null,null,null,"Uploaded to HCD?",null,null,null,null,null,null,null,{"$f":"IF('Project Overview'!$AL$353=\"Yes\",\"P\",\"O\")","v":"O"}]
[null,"25. OOR Underwriting and Construction Requirements",null,null,null,null,null,null,null,null,"Program Recipients shall develop and employ Owner-Occupied Rehabilitation Program Guidelines submitted to and approved by the Department.",null,null,null,null,null,null,null,null,null,null,null,null,null,null,null,null,null,"Uploaded to HCD?",null,null,null,null,null,null,null,{"$f":"IF('Project Overview'!$AL$364=\"Yes\",\"P\",\"O\")","v":"O"}]
[null,"26. ADU-JADU Underwriting and Construction Requirements",null,null,null,null,null,null,null,null,"Recipients shall develop and employ ADU/JADU Program Guidelines submitted to and approved by the Department addressing the following topics there in Section 405.4",null,null,null,null,null,null,null,null,null,null,null,null,null,null,null,null,null,"Uploaded to HCD?",null,null,null,null,null,null,null,{"$f":"IF('Project Overview'!$AL$392=\"Yes\",\"P\",\"O\")","v":"O"}]
[]
[null,"From \"HDPL Dev Sources\" Sheet/tab"]
[null,"27. EFC #1, EFC #2, etc.",null,null,null,null,null,null,null,null,"Provide all commitment letters or other evidence documenting construction financing commitments.",null,null,null,null,null,null,null,null,null,null,null,null,null,null,null,null,null,"Uploaded to HCD?",null,null,null,null,null,null,null,{"$f":"IF('HDPL Dev Sources'!$K$15=\"Yes\",\"P\",\"O\")","v":"O"}]
[]
[null,"From \"CalHome Threshold Requirements\" Sheet/tab"]
[null,"28. CalH AS1 Certificate of GS\n28. CalH AS2 Certificate of GS\n28. CalH AS3 Certificate of GS",null,null,null,null,null,null,null,null,"Provide a Certificate of Good Standing for each Admistrative Subcontractor; must be dated 30 days or less from the application due date.",null,null,null,null,null,null,null,null,null,null,null,null,null,null,null,null,null,"Uploaded to HCD?",null,null,null,null,null,null,null,{"$f":"IF('CalHome Threshold Requirements'!$AL$45=\"Yes\",\"P\",\"O\")","v":"O"}]
[null,"29. CalH Consortium Agreement",null,null,null,null,null,null,null,null,"Provide the legally binding agreement between the parties.",null,null,null,null,null,null,null,null,null,null,null,null,null,null,null,null,null,"Uploaded to HCD?",null,null,null,null,null,null,null,{"$f":"IF('CalHome Threshold Requirements'!$AL$48=\"Yes\",\"P\",\"O\")","v":"O"}]
[null,"30. CalH Local Public Project or Housing Program",null,null,null,null,null,null,null,null,"Provide documentation for the Local Public Entity that is not a Tribal Entity and that has developed a project or operated a housing program in California within the past two years preceding application due date.",null,null,null,null,null,null,null,null,null,null,null,null,null,null,null,null,null,"Uploaded to HCD?",null,null,null,null,null,null,null,{"$f":"IF('CalHome Threshold Requirements'!#REF!=\"Yes\",\"P\",\"O\")","v":{"$error":"#REF!"}},"This item has been purposely removed"]
[null,"31. CalH Local Public USDA Agreement",null,null,null,null,null,null,null,null,"Provide a copy of the existing Grant Agreement with the USDA.",null,null,null,null,null,null,null,null,null,null,null,null,null,null,null,null,null,"Uploaded to HCD?",null,null,null,null,null,null,null,{"$f":"IF('CalHome Threshold Requirements'!#REF!=\"Yes\",\"P\",\"O\")","v":{"$error":"#REF!"}},"This item has been purposely removed"]
[null,"32. CalH Project or Housing Program",null,null,null,null,null,null,null,null,"Provide documentation for the Nonprofit Corporation or Tribally Designated Housing Entity that has developed a project or operated a housing program in California within the past two years preceding application due date.",null,null,null,null,null,null,null,null,null,null,null,null,null,null,null,null,null,"Uploaded to HCD?",null,null,null,null,null,null,null,{"$f":"IF('CalHome Threshold Requirements'!$AL$25=\"Yes\",\"P\",\"O\")","v":"O"}]
[null,"33. CalH USDA Agreement",null,null,null,null,null,null,null,null,"Provide a copy of the existing Grant Agreement with the USDA.",null,null,null,null,null,null,null,null,null,null,null,null,null,null,null,null,null,"Uploaded to HCD?",null,null,null,null,null,null,null,{"$f":"IF('CalHome Threshold Requirements'!$AL$27=\"Yes\",\"P\",\"O\")","v":"O"}]
[null,{"$f":"IF('CalHome Threshold Requirements'!$N$34=\"housing program administrator\",\"34. CalH housing program administrator\",IF('CalHome Threshold Requirements'!$N$34=\"housing Developer\",\"34. CalH Housing Developer\",\"\"))","v":""},null,null,null,null,null,null,null,null,"Provide documentation that the Applicant has been operating as a housing Developer or housing program administrator for a minimum of two years preceding the Application due date.",null,null,null,null,null,null,null,null,null,null,null,null,null,null,null,null,null,"Uploaded to HCD?",null,null,null,null,null,null,null,{"$f":"IF('CalHome Threshold Requirements'!$AL$35=\"Yes\",\"P\",\"O\")","v":"O"}]
[null,"35. CalH AS binding agreement",null,null,null,null,null,null,null,null,"Provide an executed binding agreement between the Applicant and Administrative Subcontractor.",null,null,null,null,null,null,null,null,null,null,null,null,null,null,null,null,null,"Uploaded to HCD?",null,null,null,null,null,null,null,{"$f":"IF('CalHome Threshold Requirements'!$AL$40=\"Yes\",\"P\",\"O\")","v":"O"}]
[null,"36. CalH 184 IHLGP",null,null,null,null,null,null,null,null,"Provide documentation that the Applicant/Tribal Entity have experience with §184 Indian Home Loan Guarantee program.",null,null,null,null,null,null,null,null,null,null,null,null,null,null,null,null,null,"Uploaded to HCD?",null,null,null,null,null,null,null,{"$f":"IF('CalHome Threshold Requirements'!$AL$37=\"Yes\",\"P\",\"O\")","v":"O"}]
[null,"37. CalH Nonprofit Activity - 2 years",null,null,null,null,null,null,null,null,"Provide documentation that the Applicant, for the two years preceding the application date, have included the activity for which it is applying.",null,null,null,null,null,null,null,null,null,null,null,null,null,null,null,null,null,"Uploaded to HCD?",null,null,null,null,null,null,null,{"$f":"IF('CalHome Threshold Requirements'!$AL$51=\"Yes\",\"P\",\"O\")","v":"O"}]
[null,"38. CalH Audited Financial Statements",null,null,null,null,null,null,null,null,"Provide a copy of audited financial statements (most recent 2 years)",null,null,null,null,null,null,null,null,null,null,null,null,null,null,null,null,null,"Uploaded to HCD?",null,null,null,null,null,null,null,{"$f":"IF('CalHome Threshold Requirements'!$AL$54=\"Yes\",\"P\",\"O\")","v":"O"}]
[null,"39. CalH Construction Work Exception",null,null,null,null,null,null,null,null,"Provide an explanation how the Project meets the exceptions specified in program Guidelines §201(a)(2).",null,null,null,null,null,null,null,null,null,null,null,null,null,null,null,null,null,"Uploaded to HCD?",null,null,null,null,null,null,null,{"$f":"IF('CalHome Threshold Requirements'!$AL$78=\"Yes\",\"P\",\"O\")","v":"O"}]
[]
[null,"From \"FWHG Threshold Requirements\" Sheet/tab"]
[null,"40. FWHG AS1 Certificate of GS\n40. FWHG AS2 Certificate of GS\n40. FWHG AS3 Certificate of GS",null,null,null,null,null,null,null,null,"Provide a Certificate of Good Standing for each Admistrative Subcontractor; must be dated 30 days or less from the application due date.",null,null,null,null,null,null,null,null,null,null,null,null,null,null,null,null,null,"Uploaded to HCD?",null,null,null,null,null,null,null,{"$f":"IF('FWHG Threshold Requiremets'!$AL$45=\"Yes\",\"P\",\"O\")","v":"O"}]
[null,"41. FWHG Consortium Agreement",null,null,null,null,null,null,null,null,"Provide the legally binding agreement between the parties.",null,null,null,null,null,null,null,null,null,null,null,null,null,null,null,null,null,"Uploaded to HCD?",null,null,null,null,null,null,null,{"$f":"IF('FWHG Threshold Requiremets'!$AL$48=\"Yes\",\"P\",\"O\")","v":"O"}]
[null,"42. FWHG Project or Housing Program",null,null,null,null,null,null,null,null,"Provide documentation for the Nonprofit Corporation that has developed a project or operated a housing program in California within the past two years preceding application due date.",null,null,null,null,null,null,null,null,null,null,null,null,null,null,null,null,null,"Uploaded to HCD?",null,null,null,null,null,null,null,{"$f":"IF('FWHG Threshold Requiremets'!$AL$25=\"Yes\",\"P\",\"O\")","v":"O"}]
[null,"43. FWHG USDA Agreement",null,null,null,null,null,null,null,null,"Provide a copy of the existing Grant Agreement with the USDA.",null,null,null,null,null,null,null,null,null,null,null,null,null,null,null,null,null,"Uploaded to HCD?",null,null,null,null,null,null,null,{"$f":"IF('FWHG Threshold Requiremets'!$AL$27=\"Yes\",\"P\",\"O\")","v":"O"}]
[null,{"$f":"IF('FWHG Threshold Requiremets'!$N$34=\"housing program administrator\",\"44. FWHG housing program administrator\",IF('FWHG Threshold Requiremets'!$N$34=\"housing Developer\",\"44. FWHG Housing Developer\",\"\"))","v":""},null,null,null,null,null,null,null,null,"Provide documentation that the Applicant been operating as a housing Developer or housing program administrator for a minimum of two years preceding the Application due date.",null,null,null,null,null,null,null,null,null,null,null,null,null,null,null,null,null,"Uploaded to HCD?",null,null,null,null,null,null,null,{"$f":"IF('FWHG Threshold Requiremets'!$AL$35=\"Yes\",\"P\",\"O\")","v":"O"}]
[null,"45. FWHG AS binding agreement",null,null,null,null,null,null,null,null,"Provide an executed binding agreement between the Applicant and Administrative Subcontractor.",null,null,null,null,null,null,null,null,null,null,null,null,null,null,null,null,null,"Uploaded to HCD?",null,null,null,null,null,null,null,{"$f":"IF('FWHG Threshold Requiremets'!$AL$40=\"Yes\",\"P\",\"O\")","v":"O"}]
[null,"46. FWHG Nonprofit Activity - 2 years",null,null,null,null,null,null,null,null,"Provide documentation that the Applicant, for the two years preceding the application date, have included the activity for which it is applying.",null,null,null,null,null,null,null,null,null,null,null,null,null,null,null,null,null,"Uploaded to HCD?",null,null,null,null,null,null,null,{"$f":"IF('FWHG Threshold Requiremets'!$AL$51=\"Yes\",\"P\",\"O\")","v":"O"}]
[null,"47. FWHG Audited Financial Statements",null,null,null,null,null,null,null,null,"Provide a copy of audited financial statements (most recent 2 years)",null,null,null,null,null,null,null,null,null,null,null,null,null,null,null,null,null,"Uploaded to HCD?",null,null,null,null,null,null,null,{"$f":"IF('FWHG Threshold Requiremets'!$AL$54=\"Yes\",\"P\",\"O\")","v":"O"}]
[null,"48. FWHG Construction Work Exception",null,null,null,null,null,null,null,null,"Provide an explanation how the Project meets the exceptions specified in program Guidelines §201(a)(2).",null,null,null,null,null,null,null,null,null,null,null,null,null,null,null,null,null,"Uploaded to HCD?",null,null,null,null,null,null,null,{"$f":"IF('FWHG Threshold Requiremets'!$AL$79=\"Yes\",\"P\",\"O\")","v":"O"}]
[null,"49. FWHG Site Control",null,null,null,null,null,null,null,null,"Documentation of site control in accordance with §400.3, including a summary explanation of site control and values for applications with multiple or non-contiguous parcels, scattered sites, lot line adjustments, phased projects, or other complex land and acquisition transactions.",null,null,null,null,null,null,null,null,null,null,null,null,null,null,null,null,null,"Uploaded to HCD?",null,null,null,null,null,null,null,{"$f":"IF('FWHG Threshold Requiremets'!$AL$175=\"Yes\",\"P\",\"O\")","v":"O"}]
[null,"50. FWHG Preliminary Title Report",null,null,null,null,null,null,null,null,"Provide a preliminary report dated within 30 days of application due date. For projects developed in Indian country, an attorney’s opinion regarding chain of title and current title status is acceptable in lieu of a title report.",null,null,null,null,null,null,null,null,null,null,null,null,null,null,null,null,null,"Uploaded to HCD?",null,null,null,null,null,null,null,{"$f":"IF('FWHG Threshold Requiremets'!$AL$176=\"Yes\",\"P\",\"O\")","v":"O"}]
[null,"51. FWHG Appraisal",null,null,null,null,null,null,null,null,"If land cost or value is included in the development budget, an appraisal report supporting the cost or value is required. ",null,null,null,null,null,null,null,null,null,null,null,null,null,null,null,null,null,"Uploaded to HCD?",null,null,null,null,null,null,null,{"$f":"IF('FWHG Threshold Requiremets'!$AL$177=\"Yes\",\"P\",\"O\")","v":"O"}]
[null,"52. FWHG Market Analysis",null,null,null,null,null,null,null,null,"For Homeownership Development Projects, provide a market analysis that summarizes the local area market data that demonstrates the need for the development of additional affordable housing matching the proposed project.",null,null,null,null,null,null,null,null,null,null,null,null,null,null,null,null,null,"Uploaded to HCD?",null,null,null,null,null,null,null,{"$f":"IF('FWHG Threshold Requiremets'!$AL$184=\"Yes\",\"P\",\"O\")","v":"O"}]
[null,"53. FWHG Market Study",null,null,null,null,null,null,null,null,"Provide a market study verifying an adequate Agricultural Worker market for their Project or Program.",null,null,null,null,null,null,null,null,null,null,null,null,null,null,null,null,null,"Uploaded to HCD?",null,null,null,null,null,null,null,{"$f":"IF('FWHG Threshold Requiremets'!$AL$196=\"Yes\",\"P\",\"O\")","v":"O"}]
[]
[null,"From \"HOSN Scoring\" Sheet/tab"]
[null,"54. CalHome HDPL Federal Promise Zone",null,null,null,null,null,null,null,null,"Provide a Project/Program area map, indicate the approximate location of the Project/Program on the map.",null,null,null,null,null,null,null,null,null,null,null,null,null,null,null,null,null,"Uploaded to HCD?",null,null,null,null,null,null,null,{"$f":"IF('HOSN Scoring'!$AL$87=\"Yes\",\"P\",\"O\")","v":"O"}]
[null,"55. CalHome HDPL Choice Neighborhood Initiative Area",null,null,null,null,null,null,null,null,"Provide documentation that ensures all units are or will be within a Choice Neighborhood Initiative Area.",null,null,null,null,null,null,null,null,null,null,null,null,null,null,null,null,null,"Uploaded to HCD?",null,null,null,null,null,null,null,{"$f":"IF('HOSN Scoring'!$AL$88=\"Yes\",\"P\",\"O\")","v":"O"}]
[null,"56. CalHome HDPL Opportunity Zone",null,null,null,null,null,null,null,null,"Provide a Project/Program opportunity zone map, indicate the approximate location of the Project/Program on the map.",null,null,null,null,null,null,null,null,null,null,null,null,null,null,null,null,null,"Uploaded to HCD?",null,null,null,null,null,null,null,{"$f":"IF('HOSN Scoring'!$AL$90=\"Yes\",\"P\",\"O\")","v":"O"}]
[null,"57. CalHome HDPL Justice40 Initiative",null,null,null,null,null,null,null,null,"Provide a Project/Program disadvantaged community map, indicate the approximate location(s) of the Project/Program on the map.",null,null,null,null,null,null,null,null,null,null,null,null,null,null,null,null,null,"Uploaded to HCD?",null,null,null,null,null,null,null,{"$f":"IF('HOSN Scoring'!$AL$92=\"Yes\",\"P\",\"O\")","v":"O"}]
[null,"58. FWHG HDPL Federal Promise Zone",null,null,null,null,null,null,null,null,"Provide a Project/Program area map, indicate the approximate location of the Project/Program on the map.",null,null,null,null,null,null,null,null,null,null,null,null,null,null,null,null,null,"Uploaded to HCD?",null,null,null,null,null,null,null,{"$f":"IF('HOSN Scoring'!$AL$104=\"Yes\",\"P\",\"O\")","v":"O"}]
[null,"59. FWHG HDPL Choice Neighborhood Initiative Area",null,null,null,null,null,null,null,null,"Provide documentation that ensures all units are or will be within a Choice Neighborhood Initiative Area.",null,null,null,null,null,null,null,null,null,null,null,null,null,null,null,null,null,"Uploaded to HCD?",null,null,null,null,null,null,null,{"$f":"IF('HOSN Scoring'!$AL$105=\"Yes\",\"P\",\"O\")","v":"O"}]
[null,"60. FWHG HDPL Opportunity Zone",null,null,null,null,null,null,null,null,"Provide a Project/Program opportunity zone map, indicate the approximate location of the Project/Program on the map.",null,null,null,null,null,null,null,null,null,null,null,null,null,null,null,null,null,"Uploaded to HCD?",null,null,null,null,null,null,null,{"$f":"IF('HOSN Scoring'!$AL$107=\"Yes\",\"P\",\"O\")","v":"O"}]
[null,"61. FWHG HDPL Justice40 Initiative",null,null,null,null,null,null,null,null,"Provide a Project/Program disadvantaged community map, indicate the approximate location(s) of the Project/Program on the map.",null,null,null,null,null,null,null,null,null,null,null,null,null,null,null,null,null,"Uploaded to HCD?",null,null,null,null,null,null,null,{"$f":"IF('HOSN Scoring'!$AL$109=\"Yes\",\"P\",\"O\")","v":"O"}]
[null,"62. CalHome SHTA Federal Promise Zone",null,null,null,null,null,null,null,null,"Provide a Project/Program area map, indicate the approximate location of the Project/Program on the map.",null,null,null,null,null,null,null,null,null,null,null,null,null,null,null,null,null,"Uploaded to HCD?",null,null,null,null,null,null,null,{"$f":"IF('HOSN Scoring'!$AL$121=\"Yes\",\"P\",\"O\")","v":"O"}]
[null,"63. CalHome SHTA Choice Neighborhood Initiative Area",null,null,null,null,null,null,null,null,"Provide documentation that ensures all units are or will be within a Choice Neighborhood Initiative Area.",null,null,null,null,null,null,null,null,null,null,null,null,null,null,null,null,null,"Uploaded to HCD?",null,null,null,null,null,null,null,{"$f":"IF('HOSN Scoring'!$AL$122=\"Yes\",\"P\",\"O\")","v":"O"}]
[null,"64. CalHome SHTA Opportunity Zone",null,null,null,null,null,null,null,null,"Provide a Project/Program opportunity zone map, indicate the approximate location of the Project/Program on the map.",null,null,null,null,null,null,null,null,null,null,null,null,null,null,null,null,null,"Uploaded to HCD?",null,null,null,null,null,null,null,{"$f":"IF('HOSN Scoring'!$AL$124=\"Yes\",\"P\",\"O\")","v":"O"}]
[null,"65. CalHome SHTA Justice40 Initiative",null,null,null,null,null,null,null,null,"Provide a Project/Program disadvantaged community map, indicate the approximate location(s) of the Project/Program on the map.",null,null,null,null,null,null,null,null,null,null,null,null,null,null,null,null,null,"Uploaded to HCD?",null,null,null,null,null,null,null,{"$f":"IF('HOSN Scoring'!$AL$126=\"Yes\",\"P\",\"O\")","v":"O"}]
[null,"66. FWHG SHTA Federal Promise Zone",null,null,null,null,null,null,null,null,"Provide a Project/Program area map, indicate the approximate location of the Project/Program on the map.",null,null,null,null,null,null,null,null,null,null,null,null,null,null,null,null,null,"Uploaded to HCD?",null,null,null,null,null,null,null,{"$f":"IF('HOSN Scoring'!$AL$140=\"Yes\",\"P\",\"O\")","v":"O"}]
[null,"67. FWHG SHTA Choice Neighborhood Initiative Area",null,null,null,null,null,null,null,null,"Provide documentation that ensures all units are or will be within a Choice Neighborhood Initiative Area.",null,null,null,null,null,null,null,null,null,null,null,null,null,null,null,null,null,"Uploaded to HCD?",null,null,null,null,null,null,null,{"$f":"IF('HOSN Scoring'!$AL$141=\"Yes\",\"P\",\"O\")","v":"O"}]
[null,"68. FWHG SHTA Opportunity Zone",null,null,null,null,null,null,null,null,"Provide a Project/Program opportunity zone map, indicate the approximate location of the Project/Program on the map.",null,null,null,null,null,null,null,null,null,null,null,null,null,null,null,null,null,"Uploaded to HCD?",null,null,null,null,null,null,null,{"$f":"IF('HOSN Scoring'!$AL$143=\"Yes\",\"P\",\"O\")","v":"O"}]
[null,"69. FWHG SHTA Justice40 Initiative",null,null,null,null,null,null,null,null,"Provide a Project/Program disadvantaged community map, indicate the approximate location(s) of the Project/Program on the map.",null,null,null,null,null,null,null,null,null,null,null,null,null,null,null,null,null,"Uploaded to HCD?",null,null,null,null,null,null,null,{"$f":"IF('HOSN Scoring'!$AL$145=\"Yes\",\"P\",\"O\")","v":"O"}]
[null,"70. CalHome MA Federal Promise Zone",null,null,null,null,null,null,null,null,"Provide a Project/Program area map, indicate the approximate location of the Project/Program on the map.",null,null,null,null,null,null,null,null,null,null,null,null,null,null,null,null,null,"Uploaded to HCD?",null,null,null,null,null,null,null,{"$f":"IF('HOSN Scoring'!$AL$159=\"Yes\",\"P\",\"O\")","v":"O"}]
[null,"71. CalHome MA Choice Neighborhood Initiative Area",null,null,null,null,null,null,null,null,"Provide documentation that ensures all units are or will be within a Choice Neighborhood Initiative Area.",null,null,null,null,null,null,null,null,null,null,null,null,null,null,null,null,null,"Uploaded to HCD?",null,null,null,null,null,null,null,{"$f":"IF('HOSN Scoring'!$AL$160=\"Yes\",\"P\",\"O\")","v":"O"}]
[null,"72. CalHome MA Opportunity Zone",null,null,null,null,null,null,null,null,"Provide a Project/Program opportunity zone map, indicate the approximate location of the Project/Program on the map.",null,null,null,null,null,null,null,null,null,null,null,null,null,null,null,null,null,"Uploaded to HCD?",null,null,null,null,null,null,null,{"$f":"IF('HOSN Scoring'!$AL$162=\"Yes\",\"P\",\"O\")","v":"O"}]
[null,"73. CalHome MA Justice40 Initiative",null,null,null,null,null,null,null,null,"Provide a Project/Program disadvantaged community map, indicate the approximate location(s) of the Project/Program on the map.",null,null,null,null,null,null,null,null,null,null,null,null,null,null,null,null,null,"Uploaded to HCD?",null,null,null,null,null,null,null,{"$f":"IF('HOSN Scoring'!$AL$164=\"Yes\",\"P\",\"O\")","v":"O"}]
[null,"74. FWHG MA Federal Promise Zone",null,null,null,null,null,null,null,null,"Provide a Project/Program area map, indicate the approximate location of the Project/Program on the map.",null,null,null,null,null,null,null,null,null,null,null,null,null,null,null,null,null,"Uploaded to HCD?",null,null,null,null,null,null,null,{"$f":"IF('HOSN Scoring'!$AL$178=\"Yes\",\"P\",\"O\")","v":"O"}]
[null,"75. FWHG MA Choice Neighborhood Initiative Area",null,null,null,null,null,null,null,null,"Provide documentation that ensures all units are or will be within a Choice Neighborhood Initiative Area.",null,null,null,null,null,null,null,null,null,null,null,null,null,null,null,null,null,"Uploaded to HCD?",null,null,null,null,null,null,null,{"$f":"IF('HOSN Scoring'!$AL$179=\"Yes\",\"P\",\"O\")","v":"O"}]
[null,"76. FWHG MA Opportunity Zone",null,null,null,null,null,null,null,null,"Provide a Project/Program opportunity zone map, indicate the approximate location of the Project/Program on the map.",null,null,null,null,null,null,null,null,null,null,null,null,null,null,null,null,null,"Uploaded to HCD?",null,null,null,null,null,null,null,{"$f":"IF('HOSN Scoring'!$AL$181=\"Yes\",\"P\",\"O\")","v":"O"}]
[null,"77. FWHG MA Justice40 Initiative",null,null,null,null,null,null,null,null,"Provide a Project/Program disadvantaged community map, indicate the approximate location(s) of the Project/Program on the map.",null,null,null,null,null,null,null,null,null,null,null,null,null,null,null,null,null,"Uploaded to HCD?",null,null,null,null,null,null,null,{"$f":"IF('HOSN Scoring'!$AL$183=\"Yes\",\"P\",\"O\")","v":"O"}]
[null,"78. CalHome OOR Federal Promise Zone",null,null,null,null,null,null,null,null,"Provide a Project/Program area map, indicate the approximate location of the Project/Program on the map.",null,null,null,null,null,null,null,null,null,null,null,null,null,null,null,null,null,"Uploaded to HCD?",null,null,null,null,null,null,null,{"$f":"IF('HOSN Scoring'!$AL$197=\"Yes\",\"P\",\"O\")","v":"O"}]
[null,"79. CalHome OOR Choice Neighborhood Initiative Area",null,null,null,null,null,null,null,null,"Provide documentation that ensures all units are or will be within a Choice Neighborhood Initiative Area.",null,null,null,null,null,null,null,null,null,null,null,null,null,null,null,null,null,"Uploaded to HCD?",null,null,null,null,null,null,null,{"$f":"IF('HOSN Scoring'!$AL$198=\"Yes\",\"P\",\"O\")","v":"O"}]
[null,"80. CalHome OOR Opportunity Zone",null,null,null,null,null,null,null,null,"Provide a Project/Program opportunity zone map, indicate the approximate location of the Project/Program on the map.",null,null,null,null,null,null,null,null,null,null,null,null,null,null,null,null,null,"Uploaded to HCD?",null,null,null,null,null,null,null,{"$f":"IF('HOSN Scoring'!$AL$200=\"Yes\",\"P\",\"O\")","v":"O"}]
[null,"81. CalHome OOR Justice40 Initiative",null,null,null,null,null,null,null,null,"Provide a Project/Program disadvantaged community map, indicate the approximate location(s) of the Project/Program on the map.",null,null,null,null,null,null,null,null,null,null,null,null,null,null,null,null,null,"Uploaded to HCD?",null,null,null,null,null,null,null,{"$f":"IF('HOSN Scoring'!$AL$202=\"Yes\",\"P\",\"O\")","v":"O"}]
[null,"82. FWHG OOR Federal Promise Zone",null,null,null,null,null,null,null,null,"Provide a Project/Program area map, indicate the approximate location of the Project/Program on the map.",null,null,null,null,null,null,null,null,null,null,null,null,null,null,null,null,null,"Uploaded to HCD?",null,null,null,null,null,null,null,{"$f":"IF('HOSN Scoring'!$AL$216=\"Yes\",\"P\",\"O\")","v":"O"}]
[null,"83. FWHG OOR Choice Neighborhood Initiative Area",null,null,null,null,null,null,null,null,"Provide documentation that ensures all units are or will be within a Choice Neighborhood Initiative Area.",null,null,null,null,null,null,null,null,null,null,null,null,null,null,null,null,null,"Uploaded to HCD?",null,null,null,null,null,null,null,{"$f":"IF('HOSN Scoring'!$AL$217=\"Yes\",\"P\",\"O\")","v":"O"}]
[null,"84. FWHG OOR Opportunity Zone",null,null,null,null,null,null,null,null,"Provide a Project/Program opportunity zone map, indicate the approximate location of the Project/Program on the map.",null,null,null,null,null,null,null,null,null,null,null,null,null,null,null,null,null,"Uploaded to HCD?",null,null,null,null,null,null,null,{"$f":"IF('HOSN Scoring'!$AL$219=\"Yes\",\"P\",\"O\")","v":"O"}]
[null,"85. FWHG OOR Justice40 Initiative",null,null,null,null,null,null,null,null,"Provide a Project/Program disadvantaged community map, indicate the approximate location(s) of the Project/Program on the map.",null,null,null,null,null,null,null,null,null,null,null,null,null,null,null,null,null,"Uploaded to HCD?",null,null,null,null,null,null,null,{"$f":"IF('HOSN Scoring'!$AL$221=\"Yes\",\"P\",\"O\")","v":"O"}]
[null,"85. CalHome SH Grants Federal Promise Zone",null,null,null,null,null,null,null,null,"Provide a Project/Program area map, indicate the approximate location of the Project/Program on the map.",null,null,null,null,null,null,null,null,null,null,null,null,null,null,null,null,null,"Uploaded to HCD?",null,null,null,null,null,null,null,{"$f":"IF('HOSN Scoring'!$AL$235=\"Yes\",\"P\",\"O\")","v":"O"}]
[null,"87. CalHome SH Grants Choice Neighborhood Initiative Area",null,null,null,null,null,null,null,null,"Provide documentation that ensures all units are or will be within a Choice Neighborhood Initiative Area.",null,null,null,null,null,null,null,null,null,null,null,null,null,null,null,null,null,"Uploaded to HCD?",null,null,null,null,null,null,null,{"$f":"IF('HOSN Scoring'!$AL$236=\"Yes\",\"P\",\"O\")","v":"O"}]
[null,"88. CalHome SH Grants Opportunity Zone",null,null,null,null,null,null,null,null,"Provide a Project/Program opportunity zone map, indicate the approximate location of the Project/Program on the map.",null,null,null,null,null,null,null,null,null,null,null,null,null,null,null,null,null,"Uploaded to HCD?",null,null,null,null,null,null,null,{"$f":"IF('HOSN Scoring'!$AL$238=\"Yes\",\"P\",\"O\")","v":"O"}]
[null,"89. CalHome SH Grants Justice40 Initiative",null,null,null,null,null,null,null,null,"Provide a Project/Program disadvantaged community map, indicate the approximate location(s) of the Project/Program on the map.",null,null,null,null,null,null,null,null,null,null,null,null,null,null,null,null,null,"Uploaded to HCD?",null,null,null,null,null,null,null,{"$f":"IF('HOSN Scoring'!$AL$240=\"Yes\",\"P\",\"O\")","v":"O"}]
[null,"90. CalHome ADU-JADU Grants Federal Promise Zone",null,null,null,null,null,null,null,null,"Provide a Project/Program area map, indicate the approximate location of the Project/Program on the map.",null,null,null,null,null,null,null,null,null,null,null,null,null,null,null,null,null,"Uploaded to HCD?",null,null,null,null,null,null,null,{"$f":"IF('HOSN Scoring'!$AL$254=\"Yes\",\"P\",\"O\")","v":"O"}]
[null,"91. CalHome ADU-JADU Grants Choice Neighborhood Initiative Area",null,null,null,null,null,null,null,null,"Provide documentation that ensures all units are or will be within a Choice Neighborhood Initiative Area.",null,null,null,null,null,null,null,null,null,null,null,null,null,null,null,null,null,"Uploaded to HCD?",null,null,null,null,null,null,null,{"$f":"IF('HOSN Scoring'!$AL$255=\"Yes\",\"P\",\"O\")","v":"O"}]
[null,"92. CalHome ADU-JADU Grants Opportunity Zone",null,null,null,null,null,null,null,null,"Provide a Project/Program opportunity zone map, indicate the approximate location of the Project/Program on the map.",null,null,null,null,null,null,null,null,null,null,null,null,null,null,null,null,null,"Uploaded to HCD?",null,null,null,null,null,null,null,{"$f":"IF('HOSN Scoring'!$AL$257=\"Yes\",\"P\",\"O\")","v":"O"}]
[null,"93. CalHome ADU-JADU Grants Justice40 Initiative",null,null,null,null,null,null,null,null,"Provide a Project/Program disadvantaged community map, indicate the approximate location(s) of the Project/Program on the map.",null,null,null,null,null,null,null,null,null,null,null,null,null,null,null,null,null,"Uploaded to HCD?",null,null,null,null,null,null,null,{"$f":"IF('HOSN Scoring'!$AL$259=\"Yes\",\"P\",\"O\")","v":"O"}]
[null,"94. FWHG AMH Grants Federal Promise Zone",null,null,null,null,null,null,null,null,"Provide a Project/Program area map, indicate the approximate location of the Project/Program on the map.",null,null,null,null,null,null,null,null,null,null,null,null,null,null,null,null,null,"Uploaded to HCD?",null,null,null,null,null,null,null,{"$f":"IF('HOSN Scoring'!$AL$273=\"Yes\",\"P\",\"O\")","v":"O"}]
[null,"95. FWHG AMH Choice Neighborhood Initiative Area",null,null,null,null,null,null,null,null,"Provide documentation that ensures all units are or will be within a Choice Neighborhood Initiative Area.",null,null,null,null,null,null,null,null,null,null,null,null,null,null,null,null,null,"Uploaded to HCD?",null,null,null,null,null,null,null,{"$f":"IF('HOSN Scoring'!$AL$274=\"Yes\",\"P\",\"O\")","v":"O"}]
[null,"96. FWHG AMH Opportunity Zone",null,null,null,null,null,null,null,null,"Provide a Project/Program opportunity zone map, indicate the approximate location of the Project/Program on the map.",null,null,null,null,null,null,null,null,null,null,null,null,null,null,null,null,null,"Uploaded to HCD?",null,null,null,null,null,null,null,{"$f":"IF('HOSN Scoring'!$AL$276=\"Yes\",\"P\",\"O\")","v":"O"}]
[null,"97. FWHG AMH Justice40 Initiative",null,null,null,null,null,null,null,null,"Provide a Project/Program disadvantaged community map, indicate the approximate location(s) of the Project/Program on the map.",null,null,null,null,null,null,null,null,null,null,null,null,null,null,null,null,null,"Uploaded to HCD?",null,null,null,null,null,null,null,{"$f":"IF('HOSN Scoring'!$AL$278=\"Yes\",\"P\",\"O\")","v":"O"}]
[null,"98. CalHome MA infill site",null,null,null,null,null,null,null,null,"Applicants must provide a detailed map, including cross streets, showing exactly where the infill site is located.",null,null,null,null,null,null,null,null,null,null,null,null,null,null,null,null,null,"Uploaded to HCD?",null,null,null,null,null,null,null,{"$f":"IF('HOSN Scoring'!$AL$330=\"Yes\",\"P\",\"O\")","v":"O"}]
[null,"99. FWHG MA infill site",null,null,null,null,null,null,null,null,"Applicants must provide a detailed map, including cross streets, showing exactly where the infill site is located.",null,null,null,null,null,null,null,null,null,null,null,null,null,null,null,null,null,"Uploaded to HCD?",null,null,null,null,null,null,null,{"$f":"IF('HOSN Scoring'!$AL$333=\"Yes\",\"P\",\"O\")","v":"O"}]
[null,"100. CalHome HDPL infill site",null,null,null,null,null,null,null,null,"Applicants must provide a detailed map, including cross streets, showing exactly where the infill site is located.",null,null,null,null,null,null,null,null,null,null,null,null,null,null,null,null,null,"Uploaded to HCD?",null,null,null,null,null,null,null,{"$f":"IF('HOSN Scoring'!$AL$335=\"Yes\",\"P\",\"O\")","v":"O"}]
[null,"101. FWHG HDPL infill site",null,null,null,null,null,null,null,null,"Applicants must provide a detailed map, including cross streets, showing exactly where the infill site is located.",null,null,null,null,null,null,null,null,null,null,null,null,null,null,null,null,null,"Uploaded to HCD?",null,null,null,null,null,null,null,{"$f":"IF('HOSN Scoring'!$AL$337=\"Yes\",\"P\",\"O\")","v":"O"}]
[null,"102. CalHome SHTA infill site",null,null,null,null,null,null,null,null,"Applicants must provide a detailed map, including cross streets, showing exactly where the infill site is located.",null,null,null,null,null,null,null,null,null,null,null,null,null,null,null,null,null,"Uploaded to HCD?",null,null,null,null,null,null,null,{"$f":"IF('HOSN Scoring'!$AL$339=\"Yes\",\"P\",\"O\")","v":"O"}]
[null,"103. FWHG SHTA infill site",null,null,null,null,null,null,null,null,"Applicants must provide a detailed map, including cross streets, showing exactly where the infill site is located.",null,null,null,null,null,null,null,null,null,null,null,null,null,null,null,null,null,"Uploaded to HCD?",null,null,null,null,null,null,null,{"$f":"IF('HOSN Scoring'!$AL$341=\"Yes\",\"P\",\"O\")","v":"O"}]
[null,"104. CalHome ADU-JADU infill site",null,null,null,null,null,null,null,null,"Applicants must provide a detailed map, including cross streets, showing exactly where the infill site is located.",null,null,null,null,null,null,null,null,null,null,null,null,null,null,null,null,null,"Uploaded to HCD?",null,null,null,null,null,null,null,{"$f":"IF('HOSN Scoring'!$AL$343=\"Yes\",\"P\",\"O\")","v":"O"}]
[null,"105. FWHG AMH infill site",null,null,null,null,null,null,null,null,"Applicants must provide a detailed map, including cross streets, showing exactly where the infill site is located.",null,null,null,null,null,null,null,null,null,null,null,null,null,null,null,null,null,"Uploaded to HCD?",null,null,null,null,null,null,null,{"$f":"IF('HOSN Scoring'!$AL$345=\"Yes\",\"P\",\"O\")","v":"O"}]
[]
[null,"From \"Tribal NOFA Scoring\" Sheet/tab"]
[null,"106. Community Need Narrative",null,null,null,null,null,null,null,null,"Provide a Community Need Narrative describing the need in Applicant’s tribal community for the CalHome activity/activities for which Applicant is applying. ",null,null,null,null,null,null,null,null,null,null,null,null,null,null,null,null,null,"Uploaded to HCD?",null,null,null,null,null,null,null,{"$f":"IF('Tribal NOFA Scoring'!$AL$25=\"Yes\",\"P\",\"O\")","v":"O"}]
[null,"107. Community Revitalization",null,null,null,null,null,null,null,null,"Provide documentation that ensures all Units to be assisted with Program funds are, or will be, located within a federal Promise Zone, a Choice Neighborhood Initiative Area, an Opportunity Zone, or a federally designated Justice40 Initiative disadvantaged community.",null,null,null,null,null,null,null,null,null,null,null,null,null,null,null,null,null,"Uploaded to HCD?",null,null,null,null,null,null,null,{"$f":"IF('Tribal NOFA Scoring'!$AL$32=\"Yes\",\"P\",\"O\")","v":"O"}]
[null,"108. Preference efforts",null,null,null,null,null,null,null,null,"Provide a letter explaining the efforts to be made to provide preference to Tribal Households.",null,null,null,null,null,null,null,null,null,null,null,null,null,null,null,null,null,"Uploaded to HCD?",null,null,null,null,null,null,null,{"$f":"IF('Tribal NOFA Scoring'!$AL$33=\"Yes\",\"P\",\"O\")","v":"O"}]
[null,"109. Indian Country Verification",null,null,null,null,null,null,null,null,"Documentation verifying land is located in Indian Country as defined by 18 USC 1151.",null,null,null,null,null,null,null,null,null,null,null,null,null,null,null,null,null,"Uploaded to HCD?",null,null,null,null,null,null,null,{"$f":"IF('Tribal NOFA Scoring'!$AL$34=\"Yes\",\"P\",\"O\")","v":"O"}]
[]
[null,"Other Documents"]
[null,"110. \"Other\" Supporting documentation ",null,null,null,null,null,null,null,null,"Provide any other documentation that may help HCD with its threshold, scoring, or financial feasibility review. If multiple, please use 51b. \"File name\", 51c. \"File name\", etc.",null,null,null,null,null,null,null,null,null,null,null,null,null,null,null,null,null,"Uploaded to HCD?",null,null,null,null,null,null,null,"POnly if needed."]
[null,"111. Letter of Explanation",null,null,null,null,null,null,null,null,"Submit a letter of explanation providing details for all \"No\" answers that are shaded red above.",null,null,null,null,null,null,null,null,null,null,null,null,null,null,null,null,null,"Uploaded to HCD?",null,null,null,null,null,null,null,"POnly if needed."]

{"sheet":"Application Support","index":16,"n_rows":31,"n_cols":40,"rows_kept":31,"cut":false,"hidden":true,"merged":[[30,1,30,38],[16,1,16,2],[16,3,16,9],[16,10,16,15],[16,16,16,17],[16,18,16,29],[16,30,16,32],[16,33,16,35],[17,33,17,35],[17,36,17,38],[18,1,18,2],[18,3,18,9],[18,10,18,15],[18,16,18,17],[18,18,18,29],[18,30,18,32],[18,33,18,35],[18,36,18,38],[17,1,17,2],[17,3,17,9],[17,10,17,15],[17,16,17,17],[17,18,17,29],[17,30,17,32],[15,33,15,35],[15,36,15,38],[15,1,15,2],[15,3,15,9],[15,10,15,15],[15,16,15,17],[15,18,15,29],[15,30,15,32],[16,36,16,38],[13,33,13,35],[13,36,13,38],[14,1,14,2],[14,3,14,9],[14,10,14,15],[14,16,14,17],[14,18,14,29],[14,30,14,32],[14,33,14,35],[14,36,14,38],[13,1,13,2],[13,3,13,9],[13,10,13,15],[13,16,13,17],[13,18,13,29],[13,30,13,32],[11,33,11,35],[11,36,11,38],[12,1,12,2],[12,3,12,9],[12,10,12,15],[12,16,12,17],[12,18,12,29],[12,30,12,32],[12,33,12,35],[12,36,12,38],[11,1,11,2],[11,3,11,9],[11,10,11,15],[11,16,11,17],[11,18,11,29],[11,30,11,32],[9,33,9,35],[9,36,9,38],[10,1,10,2],[10,3,10,9],[10,10,10,15],[10,16,10,17],[10,18,10,29],[10,30,10,32],[10,33,10,35],[10,36,10,38],[9,1,9,2],[9,3,9,9],[9,10,9,15],[9,16,9,17],[9,18,9,29],[9,30,9,32],[7,1,7,38],[8,1,8,2],[8,3,8,9],[8,10,8,15],[8,16,8,17],[8,18,8,29],[8,30,8,32],[8,33,8,35],[8,36,8,38],[6,1,6,4],[6,5,6,15],[6,16,6,17],[6,18,6,28],[6,29,6,32],[6,33,6,38],[1,1,1,38],[3,1,3,38],[5,1,5,3],[5,4,5,17],[5,18,5,21],[5,22,5,25],[5,26,5,31],[5,32,5,38],[19,1,19,2],[19,3,19,9],[19,10,19,15],[19,16,19,17],[19,18,19,29],[19,30,19,32],[19,33,19,35],[19,36,19,38],[20,1,20,2],[20,3,20,9],[20,10,20,15],[20,16,20,17],[20,18,20,29],[20,30,20,32],[20,33,20,35],[20,36,20,38],[21,36,21,38],[22,1,22,2],[22,3,22,9],[22,10,22,15],[22,16,22,17],[22,18,22,29],[22,30,22,32],[22,33,22,35],[22,36,22,38],[21,1,21,2],[21,3,21,9],[21,10,21,15],[21,16,21,17],[21,18,21,29],[21,30,21,32],[21,33,21,35],[23,1,23,2],[23,3,23,9],[23,10,23,15],[23,16,23,17],[23,18,23,29],[23,30,23,32],[23,33,23,35],[23,36,23,38],[24,1,24,2],[24,3,24,9],[24,10,24,15],[24,16,24,17],[24,18,24,29],[24,30,24,32],[24,33,24,35],[24,36,24,38],[25,1,25,2],[25,3,25,9],[25,10,25,15],[25,16,25,17],[25,18,25,29],[25,30,25,32],[25,33,25,35],[25,36,25,38],[26,1,26,2],[26,3,26,9],[26,10,26,15],[26,16,26,17],[26,18,26,29],[26,30,26,32],[26,33,26,35],[26,36,26,38],[27,1,27,2],[27,3,27,9],[27,10,27,15],[27,16,27,17],[27,18,27,29],[27,30,27,32],[27,33,27,35],[27,36,27,38],[28,1,28,2],[28,3,28,9],[28,10,28,15],[28,16,28,17],[28,18,28,29],[28,30,28,32],[28,33,28,35],[28,36,28,38]]}
[]
[null,"Application Development Team (ADT) Support Form"]
[]
[null,"Please complete the \"yellow\" cells in the form below and email a copy of your Application to AppSupport@hcd.ca.gov & HOSN@hcd.ca.gov, a member of the Application Development Team will respond to your request as soon as possible. "]
[]
[null,"Full Name:",null,null,null,null,null,null,null,null,null,null,null,null,null,null,null,null,"Date Requested:",null,null,null,null,null,null,null,"Application Version Date:"]
[null,"Organization:",null,null,null,null,null,null,null,null,null,null,null,null,null,null,"Email:",null,null,null,null,null,null,null,null,null,null,null,null,"Contact Phone:"]
[null,"Justification:"]
[null,"Issue #",null,"Tab / Sheet Name",null,null,null,null,null,null,"Section",null,null,null,null,null,"Cell(s) #",null,"Update / Comment",null,null,null,null,null,null,null,null,null,null,null,"Urgency ",null,null,"ADT Status",null,null,"Tester",null,null,"Comments"]
[null,1]
[null,2]
[null,3]
[null,4]
[null,5]
[null,6]
[null,7]
[null,8]
[null,9]
[null,10]
[null,11]
[null,12]
[null,13]
[null,14]
[null,15]
[null,16]
[null,17]
[null,18]
[null,19]
[null,20]
[]
[null,"End of Document"]